bronze.owl
type: Ontology
license: Copyright © [2022] Peking University®
publisher: Research Center of Digital Humanities at Peking University
comment: The Ding ontology has three main goals: 1) build a knowledge representation of Ding in the Shang and Zhou dynasties in the form of an open ontology; 2) provide a knowledge base of a bilingual (English-Chinese) terminological e-dictionary of bronze Ding; 3) analyzing the evolution of bronze Ding shape.
version info: The ontology is about the Chinese bronze Ding. It is the version 1.0.
creator: Tong Wei, Yuqi Chen

is made in
type: ObjectProperty
preferred label: 被制于 @zh
range: dynasty
domain: stone

excavated site
type: ObjectProperty
preferred label: 发掘地 @zh
domain: stone
range: place

has belly shape
type: ObjectProperty
preferred label: 有腹形 @zh
range: belly shape
domain: stone

has belly wall
type: ObjectProperty
preferred label: 有腹壁 @zh
range: belly wall
domain: stone

has bottom
type: ObjectProperty
preferred label: 有底 @zh
range: bottom
domain: stone

has bottom shape
type: ObjectProperty
preferred label: 有底部形状 @zh
range: bottom shape
domain: stone

has ear direction
type: ObjectProperty
preferred label: 耳方向 @zh
domain: stone
range: direction of ears

has ear location
type: ObjectProperty
preferred label: 耳位置 @zh
domain: stone
range: location of ears

has ear shape
type: ObjectProperty
preferred label: 耳形状 @zh
domain: stone
range: shape of ears

has foot
type: ObjectProperty
preferred label: 有足 @zh
domain: stone
range: foot

has foot number
type: ObjectProperty
preferred label: 有足数量 @zh
domain: stone
range: foot number

has foot shape
type: ObjectProperty
preferred label: 有足形 @zh
domain: stone
range: foot shape

has top shape
type: ObjectProperty
preferred label: 盖顶形状 @zh
domain: stone
range: lid

has mouth
type: ObjectProperty
preferred label: 有口 @zh
domain: stone
range: mouth

has mouth shape
type: ObjectProperty
preferred label: 有口形 @zh
domain: stone
range: mouth shape

has part
type: ObjectProperty
preferred label: 有部分 @zh
domain: stone
range: part

diameter of mouth
type: DatatypeProperty
preferred label: 口径 @zh
domain: stone
range: float

height
type: DatatypeProperty
preferred label: 通高 @zh
domain: stone
range: float

is decorated by
type: DatatypeProperty
preferred label: 纹饰 @zh
domain: stone
range: float

weight
type: DatatypeProperty
preferred label: 重量 @zh
domain: stone
range: float

车马器配件
type: Class
subclass of: Function

用于饮酒
type: Class
subclass of: Function

耕种
type: Class
subclass of: Function

用于照明
type: Class
subclass of: Function

用于奏乐
type: Class
subclass of: Function

用于储存水
type: Class
subclass of: Function

战争武器
type: Class
subclass of: Function

bronze
type: Class
subclass of: material
preferred label: 青铜 @zh

dynasty
type: Class
preferred label: 朝代 @zh

用于吃饭
type: Class
subclass of: Function

material
type: Class
preferred label: 材料 @zh

animal-shaped ears
type: Class
subclass of: shape of ears
disjoint with: circular ears
disjoint with: ears with loose rings
disjoint with: semi-circular ears
disjoint with: side ears
disjoint with: VerticalEars
preferred label: 兽形耳 @zh

attached to the belly
type: Class
subclass of: location of ears
disjoint with: on the shoulder
preferred label: 在腹部 @zh

belly
type: Class
subclass of: part
preferred label: 腹 @zh

belly shape
type: Class
subclass of: belly
preferred label: 腹形状 @zh

belly wall
type: Class
subclass of: belly
preferred label: 腹壁 @zh

bottom
type: Class
subclass of: part
preferred label: 底 @zh

bottom shape
type: Class
subclass of: bottom
preferred label: 底部形状 @zh

stone
type: Class
subclass of: Restriction
  on property: isMadeOf
  some values from: bronze
preferred label: 青铜器 @zh

bulging belly
type: Class
subclass of: belly wall
disjoint with: bulging belly tapering downwards
disjoint with: constricted-waist belly
disjoint with: sagging belly
disjoint with: StraightBelly
preferred label: 鼓腹 @zh

bulging belly tapering downwards
type: Class
subclass of: belly wall
disjoint with: constricted-waist belly
disjoint with: sagging belly
disjoint with: StraightBelly
preferred label: 敛腹 @zh

bulging bottom
type: Class
subclass of: bottom shape
disjoint with: flat bottom
disjoint with: slightly bulging bottom
preferred label: 圜底 @zh

circular ears
type: Class
subclass of: shape of ears
disjoint with: ears with loose rings
disjoint with: semi-circular ears
disjoint with: side ears
disjoint with: VerticalEars
preferred label: 环耳 @zh

circular mouth
type: Class
subclass of: mouth shape
disjoint with: oblong mouth
disjoint with: rectangular mouth
disjoint with: SquareMouth
preferred label: 圆形口 @zh

Conical-legged Guanding
type: Class
subclass of: ding
subclass of: Restriction
  on property: has belly shape
  some values from: round body
subclass of: Restriction
  on property: has ear shape
  some values from: VerticalEars
subclass of: Restriction
  on property: has part
  some values from: bottom
subclass of: Restriction
  on property: has foot number
  some values from: ThreeFoot
subclass of: Class
  complement of: Restriction
    on property: has mouth
    some values from: StraightLipServingAsTenon
subclass of: Class
  complement of: Restriction
    on property: has part
    some values from: lid
subclass of: Class
  complement of: Restriction
    on property: has part
    some values from: single handle
subclass of: Restriction
  on property: has mouth shape
  some values from: circular mouth
subclass of: Class
  complement of: Restriction
    on property: has part
    some values from: spout
subclass of: Class
  complement of: Restriction
    on property: has part
    some values from: door
subclass of: Class
  complement of: Restriction
    on property: has bottom
    some values from: Tri-lobedBottom
subclass of: Restriction
  on property: has part
  some values from: constricted neck
subclass of: Class
  complement of: Restriction
    on property: has mouth
    some values from: small mouth
subclass of: Class
  complement of: Restriction
    on property: has part
    some values from: slanting shoulder
subclass of: Class
  complement of: Restriction
    on property: has part
    some values from: Swing-handle
subclass of: Restriction
  on property: has bottom shape
  some values from: bulging bottom
subclass of: Class
  complement of: Restriction
    on property: has foot
    some values from: slender and spreading legs
subclass of: Restriction
  on property: has ear location
  some values from: on the rim
subclass of: Restriction
  on property: has part
  some values from: foot
subclass of: Restriction
  on property: has ear direction
  some values from: Straight
subclass of: Class
  complement of: Restriction
    on property: has part
    some values from: constricted waist
subclass of: Restriction
  on property: has part
  some values from: belly
subclass of: Restriction
  on property: has foot shape
  some values from: conical legs
subclass of: Restriction
  on property: has part
  some values from: ears
subclass of: Restriction
  on property: has part
  some values from: mouth
concept name: <Ding without lid not straight lip serving as tenon not small mouth circular mouth without door without swing-handle without spout without single handle with ears vertical ears on the rim straight constricted neck not slanting shoulder not constricted waist round body not tri-lobed bulging bottom three legs conical legs not slender and spreading legs>
definition: Ding with circular mouth,straight vertical ears on the rim,constricted neck,round body,bulging bottom and three conical legs
preferred label: 锥足罐鼎 @zh
definition: 鼎带圆形口，竖直立耳在口沿上，束颈，圆体，圜底，三锥足 @zh

Conical-legged Guanding 1
type: Class
subclass of: Conical-legged Guanding
subclass of: Restriction
  on property: has belly wall
  some values from: sagging belly
concept name: <Conical-legged Guanding sagging belly>
definition: Conical-legged Guanding with sagging belly
preferred label: 锥足罐鼎1 @zh
definition: 锥足罐鼎垂腹 @zh

Conical-legged Guanding 2
type: Class
subclass of: Conical-legged Guanding
subclass of: Restriction
  on property: has belly wall
  some values from: bulging belly
concept name: <Conical-legged Guanding bulging belly>
definition: Conical-legged Guanding with bulging belly
preferred label: 锥足罐鼎 2 @zh
definition: 锥足罐鼎鼓腹 @zh

Conical-legged Lobed Ding 1
type: Class
subclass of: ding
subclass of: Class
  complement of: Restriction
    on property: has mouth
    some values from: small mouth
subclass of: Restriction
  on property: has mouth shape
  some values from: circular mouth
subclass of: Restriction
  on property: has belly wall
  some values from: bulging belly
subclass of: Restriction
  on property: has ear location
  some values from: on the rim
subclass of: Class
  complement of: Restriction
    on property: has mouth
    some values from: StraightLipServingAsTenon
subclass of: Restriction
  on property: has ear direction
  some values from: Straight
subclass of: Restriction
  on property: has foot shape
  some values from: conical legs
subclass of: Restriction
  on property: has foot number
  some values from: ThreeFoot
subclass of: Class
  complement of: Restriction
    on property: has part
    some values from: slanting shoulder
subclass of: Class
  complement of: Restriction
    on property: has foot
    some values from: slender and spreading legs
subclass of: Restriction
  on property: has part
  some values from: Tri-lobedBottom
subclass of: Restriction
  on property: has ear shape
  some values from: VerticalEars
subclass of: Restriction
  on property: has belly shape
  some values from: round body
concept name: <Ding without lid not straight lip serving as tenon not small mouth circular mouth without door without swing-handle without spout without single handle with ears vertical ears on the rim straight constricted neck not slanting shoulder not constricted waist round body bulging belly 分裆 three legs conical legs not slender and spreading legs>
definition: Ding with circular mouth,straight vertical ears on the rim,constricted neck,round body,bulging belly,tri-lobed and three conical legs
preferred label: 锥足鬲鼎1 @zh
definition: 鼎带圆形口，竖直立耳在口沿上，束颈，圆体，鼓腹，分裆，三锥足 @zh

Conical-legged Pending
type: Class
subclass of: ding
subclass of: Class
  complement of: Restriction
    on property: has mouth
    some values from: small mouth
subclass of: Class
  complement of: Restriction
    on property: has part
    some values from: Tri-lobedBottom
subclass of: Class
  complement of: Restriction
    on property: has foot
    some values from: slender and spreading legs
subclass of: Restriction
  on property: has foot number
  some values from: ThreeFoot
subclass of: Restriction
  on property: has foot shape
  some values from: conical legs
subclass of: Restriction
  on property: has ear direction
  some values from: Straight
subclass of: Restriction
  on property: has mouth shape
  some values from: circular mouth
subclass of: Class
  complement of: Restriction
    on property: has mouth
    some values from: StraightLipServingAsTenon
subclass of: Restriction
  on property: has belly shape
  some values from: round body
concept name: <Ding without lid not straight lip serving as tenon not small mouth circular mouth without door without swing-handle without spout without single handle with ears straight not constricted neck not slanting shoulder not constricted waist round body three legs conical legs not slender and spreading legs>
definition: Ding with circular mouth,straight ,round body, and three conical legs
preferred label: 锥足盆鼎 @zh
definition: 鼎带圆形口，竖直耳，圆体，三锥足 @zh

Conical-legged Pending with Side Ears
type: Class
subclass of: Conical-legged Pending
subclass of: Restriction
  on property: has ear location
  some values from: UnderTheRim
subclass of: Restriction
  on property: has ear shape
  some values from: side ears
subclass of: Restriction
  on property: has bottom shape
  some values from: bulging bottom
subclass of: Restriction
  on property: has belly wall
  some values from: sagging belly
concept name: <Conical-legged Pending with side ears under the rim sagging belly not tri-lobed bulging bottom>
definition: Conical-legged Pending with side ears under the rim,sagging belly and bulging bottom
definition: 锥足盆鼎带附耳在口沿下，垂腹，圜底 @zh
preferred label: 附耳锥足盆鼎 @zh

Conical-legged Pending with Vertical Ears 1
type: Class
subclass of: Conical-legged Pending
subclass of: Restriction
  on property: has bottom shape
  some values from: slightly bulging bottom
subclass of: Restriction
  on property: has belly wall
  some values from: sagging belly
subclass of: Restriction
  on property: has ear shape
  some values from: VerticalEars
subclass of: Restriction
  on property: has ear location
  some values from: on the rim
concept name: <Conical-legged Pending vertical ears on the rim sagging belly slightly bulging bottom>
definition: Conical-legged Pending with vertical ears on the rim,sagging belly,and slightly bulging bottom
preferred label: 立耳锥足盆鼎1 @zh
definition: 锥足盆鼎带立耳在口沿上，垂腹，近平底 @zh

Conical-legged Pending with Vertical Ears 2
type: Class
subclass of: Conical-legged Pending
subclass of: Restriction
  on property: has belly wall
  some values from: bulging belly
subclass of: Restriction
  on property: has bottom shape
  some values from: bulging bottom
subclass of: Restriction
  on property: has ear shape
  some values from: VerticalEars
subclass of: Restriction
  on property: has ear location
  some values from: on the rim
concept name: <Conical-legged Pending with ears vertical ears on the rim bulging belly bulging bottom>
definition: Conical-legged Pending with vertical ears on the rim,bulging belly,and bulging bottom
preferred label: 立耳锥足盆鼎2 @zh
definition: 锥足盆鼎带立耳在口沿上，鼓腹，圜底 @zh

Conical-legged Pending with Vertical Ears 3
type: Class
subclass of: Conical-legged Pending
subclass of: Restriction
  on property: has ear location
  some values from: on the rim
subclass of: Restriction
  on property: has belly wall
  some values from: bulging belly tapering downwards
subclass of: Restriction
  on property: has bottom shape
  some values from: bulging bottom
subclass of: Restriction
  on property: has ear shape
  some values from: VerticalEars
concept name: <Ding with ears vertical ears on the rim bulging belly tapering downwards bulging bottom>
definition: Conical-legged Pending with vertical ears on the rim,bulging belly tapering downwards, and bulging bottom
preferred label: 立耳锥足盆鼎3 @zh
definition: 锥足盆鼎带立耳在口沿上，敛腹，圜底 @zh

Conical-legged Pending with Vertical Ears 4
type: Class
subclass of: Conical-legged Pending
subclass of: Restriction
  on property: has ear shape
  some values from: VerticalEars
subclass of: Restriction
  on property: has belly wall
  some values from: StraightBelly
subclass of: Restriction
  on property: has ear location
  some values from: on the rim
subclass of: Restriction
  on property: has bottom shape
  some values from: bulging bottom
concept name: <Conical-legged Pending vertical ears on the rim straight belly bulging bottom>
definition: Conical-legged Pending with vertical ears on the rim,straight belly,and bulging bottom
preferred label: 立耳锥足盆鼎4 @zh
definition: 锥足盆鼎带立耳在口沿上，直腹，圜底 @zh

Conical-legged Rectangular Ding 1
type: Class
subclass of: ding
subclass of: Restriction
  on property: has ear shape
  some values from: VerticalEars
subclass of: Class
  complement of: Restriction
    on property: has part
    some values from: Tri-lobedBottom
subclass of: Restriction
  on property: has belly shape
  some values from: rectangular body
subclass of: Class
  complement of: Restriction
    on property: has foot
    some values from: slender and spreading legs
subclass of: Restriction
  on property: has ear location
  some values from: on the rim
subclass of: Restriction
  on property: has belly wall
  some values from: StraightBelly
subclass of: Restriction
  on property: has foot number
  some values from: four foot
subclass of: Class
  complement of: Restriction
    on property: has mouth
    some values from: small mouth
subclass of: Restriction
  on property: has mouth shape
  some values from: rectangular mouth
subclass of: Restriction
  on property: has ear direction
  some values from: Straight
subclass of: Class
  complement of: Restriction
    on property: has mouth
    some values from: StraightLipServingAsTenon
subclass of: Restriction
  on property: has bottom shape
  some values from: flat bottom
subclass of: Restriction
  on property: has foot shape
  some values from: conical legs
concept name: <Ding without lid not straight lip serving as tenon not small mouth rectangular mouth without door without swing-handle without spout without single handle with ears vertical ears on the rim straight not constricted neck not slanting shoulder not constricted waist rectangular body straight belly not tri-lobed flat bottom four legs conical legs not slender and spreading legs>
alternative label: Conical-legged Fangding 1
definition: Ding with rectangular mouth,straight vertical ears on the rim,rectangular body,straight belly,flat bottom and four conical legs
preferred label: 锥足方鼎1 @zh
definition: 鼎带长方形口，竖直立耳在口沿上，长方体，直腹，平底，四锥足 @zh

conical legs
type: Class
subclass of: foot shape
disjoint with: cylindrical legs
disjoint with: flat legs
disjoint with: hoof-shaped legs
disjoint with: similar conical legs
disjoint with: similar hoof-shaped legs
disjoint with: Trisquare-shapedLegs
preferred label: 锥足 @zh

constricted-waist belly
type: Class
subclass of: belly wall
disjoint with: sagging belly
disjoint with: StraightBelly
preferred label: 束腰腹 @zh

constricted neck
type: Class
subclass of: neck
preferred label: 束颈 @zh

constricted waist
type: Class
subclass of: Waist
preferred label: 束腰 @zh

Cylindrical-legged Guanding
type: Class
subclass of: ding
subclass of: Class
  complement of: Restriction
    on property: has mouth
    some values from: StraightLipServingAsTenon
subclass of: Class
  complement of: Restriction
    on property: has foot
    some values from: slender and spreading legs
subclass of: Restriction
  on property: has mouth shape
  some values from: circular mouth
subclass of: Restriction
  on property: has foot shape
  some values from: cylindrical legs
subclass of: Restriction
  on property: has ear direction
  some values from: Straight
subclass of: Restriction
  on property: has foot number
  some values from: ThreeFoot
subclass of: Class
  complement of: Restriction
    on property: has part
    some values from: Tri-lobedBottom
subclass of: Restriction
  on property: has belly shape
  some values from: round body
subclass of: Class
  complement of: Restriction
    on property: has mouth
    some values from: small mouth
concept name: <Ding without lid not straight lip serving as tenon not small mouth circular mouth without door without swing-handle without spout without single handle with ears straight constricted neck not slanting shoulder not constricted waist round body not tri-lobed three legs cylindrical legs not slender and spreading legs>
definition: Ding with circular mouth,straight ears,constricted neck,round body, and three cylindrical legs
preferred label: 柱足罐鼎 @zh
definition: 鼎带圆形口，竖直耳，束颈，圆体，三柱足 @zh

Cylindrical-legged Guanding 1
type: Class
subclass of: Cylindrical-legged Guanding
subclass of: Restriction
  on property: has ear shape
  some values from: side ears
subclass of: Restriction
  on property: has ear location
  some values from: UnderTheRim
subclass of: Restriction
  on property: has belly wall
  some values from: sagging belly
subclass of: Restriction
  on property: has bottom shape
  some values from: bulging bottom
concept name: <Cylindrical-legged Guanding side ears under the rim sagging belly bulging bottom>
definition: Cylindrical-legged Guanding with side ears under the rim,sagging belly,and bulging bottom
preferred label: 柱足罐鼎1 @zh
definition: 柱足罐鼎带附耳在口沿下，垂腹，圜底 @zh

Cylindrical-legged Guanding 2
type: Class
subclass of: Cylindrical-legged Guanding
subclass of: Restriction
  on property: has ear location
  some values from: UnderTheRim
subclass of: Restriction
  on property: has ear shape
  some values from: side ears
subclass of: Restriction
  on property: has belly wall
  some values from: StraightBelly
subclass of: Restriction
  on property: has bottom shape
  some values from: bulging bottom
concept name: <Cylindrical-legged Guanding side ears under the rim straight belly bulging bottom>
definition: Cylindrical-legged Guanding with side ears under the rim,straight belly,and bulging bottom
preferred label: 柱足罐鼎2 @zh
definition: 柱足罐鼎带附耳在口沿下，直腹，圜底 @zh

Cylindrical-legged Guanding 3
type: Class
subclass of: Cylindrical-legged Guanding
subclass of: Restriction
  on property: has ear shape
  some values from: VerticalEars
subclass of: Restriction
  on property: has bottom shape
  some values from: bulging bottom
subclass of: Restriction
  on property: has belly wall
  some values from: bulging belly
subclass of: Restriction
  on property: has ear location
  some values from: on the rim
concept name: <Cylindrical-legged Guanding vertical ears on the rim bulging belly bulging bottom>
definition: Cylindrical-legged Guanding with vertical ears on the rim,bulging belly,and bulging bottom
preferred label: 柱足罐鼎3 @zh
definition: 柱足罐鼎带立耳在口沿上，鼓腹，圜底 @zh

Cylindrical-legged Guanding 4
type: Class
subclass of: Cylindrical-legged Guanding
subclass of: Restriction
  on property: has ear shape
  some values from: VerticalEars
subclass of: Restriction
  on property: has belly wall
  some values from: sagging belly
subclass of: Restriction
  on property: has bottom shape
  some values from: bulging bottom
subclass of: Restriction
  on property: has ear location
  some values from: on the rim
concept name: <Cylindrical-legged Guanding vertical ears on the rim sagging belly bulging bottom>
definition: Cylindrical-legged Guanding with vertical ears on the rim,sagging belly,and bulging bottom
preferred label: 柱足罐鼎4 @zh
definition: 柱足罐鼎带立耳在口沿上，垂腹，圜底 @zh

Cylindrical-legged Guanding 5
type: Class
subclass of: Cylindrical-legged Guanding
subclass of: Restriction
  on property: has ear location
  some values from: on the rim
subclass of: Restriction
  on property: has ear shape
  some values from: VerticalEars
subclass of: Restriction
  on property: has bottom shape
  some values from: slightly bulging bottom
subclass of: Restriction
  on property: has belly wall
  some values from: sagging belly
concept name: <Cylindrical-legged Guanding vertical ears on the rim sagging belly slightly bulging bottom>
definition: Cylindrical-legged Guanding with vertical ears on the rim,sagging belly,and slightly bulging bottom
preferred label: 柱足罐鼎5 @zh
definition: 柱足罐鼎带立耳在口沿上，垂腹，近平底 @zh

Cylindrical-legged Lobed Ding
type: Class
subclass of: ding
subclass of: Class
  complement of: Restriction
    on property: has mouth
    some values from: small mouth
subclass of: Restriction
  on property: has belly shape
  some values from: round body
subclass of: Restriction
  on property: has part
  some values from: Tri-lobedBottom
subclass of: Restriction
  on property: has foot shape
  some values from: cylindrical legs
subclass of: Restriction
  on property: has ear location
  some values from: on the rim
subclass of: Class
  complement of: Restriction
    on property: has foot
    some values from: slender and spreading legs
subclass of: Restriction
  on property: has ear direction
  some values from: Straight
subclass of: Restriction
  on property: has mouth shape
  some values from: circular mouth
subclass of: Restriction
  on property: has foot number
  some values from: ThreeFoot
subclass of: Class
  complement of: Restriction
    on property: has mouth
    some values from: StraightLipServingAsTenon
subclass of: Restriction
  on property: has ear shape
  some values from: VerticalEars
concept name: <Ding not straight lip serving as tenon not small mouth circular mouth without door without swing-handle without spout without single handle with ears vertical ears on the rim straight not slanting shoulder not constricted waist round body tri-lobed three legs cylindrical legs not slender and spreading legs>
alternative label: Cylindrical-legged Liding
definition: Ding with circular mouth,straight vertical ears on the rim,round body,tri-lobed and three cylindrical legs
preferred label: 柱足鬲鼎 @zh
definition: 鼎带圆形口，竖直立耳在口沿上，圆体，分裆，三柱足 @zh

Cylindrical-legged Lobed Ding 1
type: Class
subclass of: Cylindrical-legged Lobed Ding
subclass of: Class
  complement of: Restriction
    on property: has part
    some values from: lid
subclass of: Class
  complement of: Restriction
    on property: has part
    some values from: constricted neck
subclass of: Restriction
  on property: has belly wall
  some values from: bulging belly
concept name: <Cylindrical-legged Lobed Ding without lid not constricted neck bulging belly>
alternative label: Cylindrical-legged Liding 1
definition: Cylindrical-legged Lobed Ding without lid, not constricted neck, and with bulging belly
preferred label: 柱足鬲鼎1 @zh
definition: 柱足鬲鼎不带盖，非束颈，带鼓腹 @zh

Cylindrical-legged Lobed Ding 2
type: Class
subclass of: Cylindrical-legged Lobed Ding
subclass of: Class
  complement of: Restriction
    on property: has part
    some values from: constricted neck
subclass of: Class
  complement of: Restriction
    on property: has part
    some values from: lid
subclass of: Restriction
  on property: has belly wall
  some values from: sagging belly
concept name: <Cylindrical-legged Lobed Ding without lid not constricted neck sagging belly>
alternative label: Cylindrical-legged Liding 2
definition: Cylindrical-legged Lobed Ding without lid, not constricted neck, with sagging belly
preferred label: 柱足鬲鼎2 @zh
definition: 柱足鬲鼎不带盖，非束颈，带垂腹 @zh

Cylindrical-legged Lobed Ding 3
type: Class
subclass of: Cylindrical-legged Lobed Ding
subclass of: Restriction
  on property: has part
  some values from: constricted neck
subclass of: Restriction
  on property: has belly wall
  some values from: sagging belly
subclass of: Class
  complement of: Restriction
    on property: has part
    some values from: lid
concept name: <Cylindrical-legged Lobed Ding without lid constricted neck sagging belly>
alternative label: Cylindrical-legged Liding 3
definition: Cylindrical-legged Lobed Ding without lid,with constricted neck,sagging belly
preferred label: 柱足鬲鼎3 @zh
definition: 柱足鬲鼎不带盖，束颈，垂腹 @zh

Cylindrical-legged Lobed Ding 4
type: Class
subclass of: Cylindrical-legged Lobed Ding
subclass of: Restriction
  on property: has part
  some values from: constricted neck
subclass of: Class
  complement of: Restriction
    on property: has part
    some values from: lid
subclass of: Restriction
  on property: has belly wall
  some values from: bulging belly
concept name: <Cylindrical-legged Lobed Ding without lid constricted neck bulging belly tri-lobed>
alternative label: Cylindrical-legged Liding 4
definition: Cylindrical-legged Lobed Ding without lid,constricted neck,and bulging belly
preferred label: 柱足鬲鼎4 @zh
definition: 柱足鬲鼎不带盖，束颈，鼓腹 @zh

Cylindrical-legged Lobed Ding 5
type: Class
subclass of: Cylindrical-legged Lobed Ding
subclass of: Restriction
  on property: has part
  some values from: lid
subclass of: Restriction
  on property: has belly wall
  some values from: bulging belly
subclass of: Restriction
  on property: has top shape
  some values from: flat lid
subclass of: Class
  complement of: Restriction
    on property: has part
    some values from: constricted neck
concept name: <Cylindrical-legged Lobed Ding with lid flat lid not constricted neck bulging belly>
alternative label: Cylindrical-legged Liding 5
definition: Cylindrical-legged Lobed Ding with flat lid,bulging belly, not constricted neck
preferred label: 柱足鬲鼎5 @zh
definition: 鼎带盖，平顶，非束颈，鼓腹 @zh

Cylindrical-legged Oblong Ding1
type: Class
subclass of: ding
subclass of: Class
  complement of: Restriction
    on property: has mouth
    some values from: small mouth
subclass of: Restriction
  on property: has ear shape
  some values from: side ears
subclass of: Restriction
  on property: has belly wall
  some values from: sagging belly
subclass of: Restriction
  on property: has foot number
  some values from: four foot
subclass of: Class
  complement of: Restriction
    on property: has foot
    some values from: slender and spreading legs
subclass of: Restriction
  on property: has part
  some values from: slightly bulging bottom
subclass of: Restriction
  on property: has mouth shape
  some values from: rectangular mouth
subclass of: Class
  complement of: Restriction
    on property: has part
    some values from: Tri-lobedBottom
subclass of: Restriction
  on property: has belly shape
  some values from: oblong body
subclass of: Restriction
  on property: has top shape
  some values from: flat lid
subclass of: Restriction
  on property: has ear direction
  some values from: Straight
subclass of: Restriction
  on property: has part
  some values from: cylindrical legs
subclass of: Restriction
  on property: has ear location
  some values from: UnderTheRim
subclass of: Class
  complement of: Restriction
    on property: has mouth
    some values from: StraightLipServingAsTenon
concept name: <Ding with lid flat lid not straight lip serving as tenon not small mouth rectangular mouth without door without swing-handle without spout without single handle with ears side ears under the rim straight constricted neck not slanting shoulder not constricted waist oblong body sagging belly not tri-lobed slightly bulging bottom four legs cylindrical legs not slender and spreading legs>
definition: Ding with flat lid,rectangular mouth,straight side ears under the rim,constricted neck,oblong body,sagging belly,slightly bulging bottom and four cylindrical legs
preferred label: 柱足椭方鼎1 @zh
definition: 鼎带盖，平顶，长方形口，竖直附耳在口沿下，束颈，椭方体，垂腹，近平底，四柱足 @zh

Cylindrical-legged Oblong Ding 10
type: Class
subclass of: ding
subclass of: Class
  complement of: Restriction
    on property: has mouth
    some values from: StraightLipServingAsTenon
subclass of: Class
  complement of: Restriction
    on property: has foot
    some values from: slender and spreading legs
subclass of: Class
  complement of: Restriction
    on property: has part
    some values from: Tri-lobedBottom
subclass of: Restriction
  on property: has foot number
  some values from: four foot
subclass of: Restriction
  on property: has bottom shape
  some values from: slightly bulging bottom
subclass of: Restriction
  on property: has ear direction
  some values from: Straight
subclass of: Restriction
  on property: has foot shape
  some values from: cylindrical legs
subclass of: Restriction
  on property: has ear location
  some values from: on the rim
subclass of: Class
  complement of: Restriction
    on property: has mouth
    some values from: small mouth
subclass of: Restriction
  on property: has belly wall
  some values from: sagging belly
subclass of: Restriction
  on property: has mouth shape
  some values from: oblong mouth
subclass of: Restriction
  on property: has belly shape
  some values from: oblong body
subclass of: Restriction
  on property: has ear shape
  some values from: VerticalEars
concept name: <Ding without lid not straight lip serving as tenon not small mouth oblong mouth without door without swing-handle without spout without single handle with ears vertical ears on the rim straight not constricted neck not slanting shoulder not constricted waist oblong body sagging belly not tri-lobed slightly bulging bottom four legs cylindrical legs not slender and spreading legs>
definition: Ding with oblong mouth,straight vertical ears on the rim,oblong body,sagging belly,slightly bulging bottom and four cylindrical legs
preferred label: 柱足椭方鼎10 @zh
definition: 鼎带椭方形口，竖直立耳在口沿上，椭方体，垂腹，近平底，四柱足 @zh

Cylindrical-legged Oblong Ding 11
type: Class
subclass of: ding
subclass of: Class
  complement of: Restriction
    on property: has part
    some values from: slanting shoulder
subclass of: Restriction
  on property: has ear direction
  some values from: Straight
subclass of: Restriction
  on property: has top shape
  some values from: flat lid
subclass of: Restriction
  on property: has mouth
  some values from: StraightLipServingAsTenon
subclass of: Class
  complement of: Restriction
    on property: has foot
    some values from: slender and spreading legs
subclass of: Restriction
  on property: has part
  some values from: belly
subclass of: Restriction
  on property: has foot shape
  some values from: cylindrical legs
subclass of: Class
  complement of: Restriction
    on property: has mouth
    some values from: small mouth
subclass of: Restriction
  on property: has mouth shape
  some values from: oblong mouth
subclass of: Restriction
  on property: has ear location
  some values from: UnderTheRim
subclass of: Restriction
  on property: has bottom shape
  some values from: slightly bulging bottom
subclass of: Restriction
  on property: has part
  some values from: lid
subclass of: Restriction
  on property: has ear shape
  some values from: side ears
subclass of: Class
  complement of: Restriction
    on property: has part
    some values from: spout
subclass of: Class
  complement of: Restriction
    on property: has part
    some values from: single handle
subclass of: Restriction
  on property: has part
  some values from: ears
subclass of: Class
  complement of: Restriction
    on property: has part
    some values from: door
subclass of: Restriction
  on property: has belly wall
  some values from: sagging belly
subclass of: Class
  complement of: Restriction
    on property: has part
    some values from: Swing-handle
subclass of: Class
  complement of: Restriction
    on property: has part
    some values from: Tri-lobedBottom
subclass of: Restriction
  on property: has foot number
  some values from: four foot
subclass of: Restriction
  on property: has part
  some values from: bottom
subclass of: Restriction
  on property: has belly shape
  some values from: oblong body
subclass of: Class
  complement of: Restriction
    on property: has part
    some values from: constricted waist
subclass of: Class
  complement of: Restriction
    on property: has part
    some values from: constricted neck
subclass of: Restriction
  on property: has part
  some values from: foot
concept name: <Ding with lid flat lid straight lip serving as tenon not small mouth oblong mouth without door without swing-handle without spout without single handle with ears side ears under the rim straight not constricted neck not slanting shoulder not constricted waist oblong body sagging belly not tri-lobed slightly bulging bottom four legs cylindrical legs not slender and spreading legs>
definition: Ding with flat lid,straight lip serving as tenon,oblong mouth,straight side ears under the rim,oblong body,sagging belly,slightly bulging bottom and four cylindrical legs
preferred label: 柱足椭方鼎11 @zh
definition: 鼎带盖，平顶，子母口，椭方形口，竖直附耳在口沿下，椭方体，垂腹，近平底，四柱足 @zh

Cylindrical-legged Oblong Ding 12
type: Class
subclass of: ding
subclass of: Restriction
  on property: has ear location
  some values from: UnderTheRim
subclass of: Restriction
  on property: has belly shape
  some values from: oblong body
subclass of: Class
  complement of: Restriction
    on property: has part
    some values from: Tri-lobedBottom
subclass of: Class
  complement of: Restriction
    on property: has part
    some values from: constricted neck
subclass of: Restriction
  on property: has ear direction
  some values from: Straight
subclass of: Class
  complement of: Restriction
    on property: has mouth
    some values from: StraightLipServingAsTenon
subclass of: Restriction
  on property: has ear shape
  some values from: side ears
subclass of: Restriction
  on property: has foot number
  some values from: four foot
subclass of: Restriction
  on property: has part
  some values from: mouth
subclass of: Class
  complement of: Restriction
    on property: has part
    some values from: spout
subclass of: Class
  complement of: Restriction
    on property: has part
    some values from: lid
subclass of: Restriction
  on property: has bottom shape
  some values from: slightly bulging bottom
subclass of: Class
  complement of: Restriction
    on property: has part
    some values from: constricted waist
subclass of: Class
  complement of: Restriction
    on property: has part
    some values from: door
subclass of: Class
  complement of: Restriction
    on property: has foot
    some values from: slender and spreading legs
subclass of: Class
  complement of: Restriction
    on property: has part
    some values from: single handle
subclass of: Restriction
  on property: has part
  some values from: ears
subclass of: Class
  complement of: Restriction
    on property: has part
    some values from: slanting shoulder
subclass of: Restriction
  on property: has part
  some values from: bottom
subclass of: Class
  complement of: Restriction
    on property: has part
    some values from: Swing-handle
subclass of: Restriction
  on property: has belly wall
  some values from: sagging belly
subclass of: Restriction
  on property: has part
  some values from: belly
subclass of: Class
  complement of: Restriction
    on property: has mouth
    some values from: small mouth
subclass of: Restriction
  on property: has part
  some values from: foot
subclass of: Restriction
  on property: has foot shape
  some values from: cylindrical legs
subclass of: Restriction
  on property: has mouth shape
  some values from: oblong mouth
concept name: <Ding without lid not straight lip serving as tenon not small mouth oblong mouth without door without swing-handle without spout without single handle with ears side ears under the rim straight not constricted neck not slanting shoulder not constricted waist oblong body sagging belly not tri-lobed slightly bulging bottom four legs cylindrical legs not slender and spreading legs>
definition: Ding with oblong mouth,straight side ears under the rim,oblong body,sagging belly,slightly bulging bottom and four cylindrical legs
preferred label: 柱足椭方鼎12 @zh
definition: 鼎带椭方形口，竖直附耳在口沿下，椭方体，垂腹，近平底，四柱足 @zh

Cylindrical-legged Oblong Ding_2
type: Class
subclass of: ding
subclass of: Class
  complement of: Restriction
    on property: has foot
    some values from: slender and spreading legs
subclass of: Restriction
  on property: has foot number
  some values from: four foot
subclass of: Restriction
  on property: has part
  some values from: Swing-handle
subclass of: Class
  complement of: Restriction
    on property: has mouth
    some values from: small mouth
subclass of: Restriction
  on property: has belly shape
  some values from: oblong body
subclass of: Class
  complement of: Restriction
    on property: has part
    some values from: slanting shoulder
subclass of: Class
  complement of: Restriction
    on property: has part
    some values from: Tri-lobedBottom
subclass of: Restriction
  on property: has top shape
  some values from: domed lid
subclass of: Class
  complement of: Restriction
    on property: has part
    some values from: spout
subclass of: Restriction
  on property: has ear shape
  some values from: semi-circular ears
subclass of: Class
  complement of: Restriction
    on property: has mouth
    some values from: StraightLipServingAsTenon
subclass of: Class
  complement of: Restriction
    on property: has part
    some values from: door
subclass of: Restriction
  on property: has mouth shape
  some values from: circular mouth
subclass of: Class
  complement of: Restriction
    on property: has part
    some values from: single handle
subclass of: Restriction
  on property: has foot shape
  some values from: cylindrical legs
subclass of: Restriction
  on property: has ear location
  some values from: UnderTheRim
subclass of: Restriction
  on property: has part
  some values from: ears
subclass of: Restriction
  on property: has belly wall
  some values from: sagging belly
subclass of: Restriction
  on property: has part
  some values from: lid
subclass of: Class
  complement of: Restriction
    on property: has part
    some values from: constricted neck
subclass of: Restriction
  on property: has bottom shape
  some values from: bulging bottom
subclass of: Restriction
  on property: has part
  some values from: foot
subclass of: Restriction
  on property: has part
  some values from: bottom
subclass of: Class
  complement of: Restriction
    on property: has part
    some values from: constricted waist
subclass of: Restriction
  on property: has part
  some values from: mouth
subclass of: Restriction
  on property: has ear direction
  some values from: Transverse
concept name: <Ding with lid domed lid not straight lip serving as tenon not small mouth circular mouth without door swing-handle without spout without single handle with ears semi-circular ears under the rim transverse not constricted neck not slanting shoulder not constricted waist oblong body sagging belly not tri-lobed bulging bottom four legs cylindrical legs not slender and spreading legs>
definition: Ding with domed lid,circular mouth,swing-handle,transverse semi-circular ears under the rim,oblong body,sagging belly,bulging bottom and four cylindrical legs
preferred label: 柱足椭方鼎2 @zh
definition: 鼎带盖，圜顶，圆形口，带提梁，横向半环耳在口沿下，椭方体，垂腹，圜底，四柱足 @zh

Cylindrical-legged Oblong Ding 3
type: Class
subclass of: ding
subclass of: Restriction
  on property: has part
  some values from: foot
subclass of: Class
  complement of: Restriction
    on property: has part
    some values from: single handle
subclass of: Restriction
  on property: has belly wall
  some values from: sagging belly
subclass of: Class
  complement of: Restriction
    on property: has part
    some values from: constricted neck
subclass of: Class
  complement of: Restriction
    on property: has part
    some values from: Swing-handle
subclass of: Restriction
  on property: has part
  some values from: bottom
subclass of: Restriction
  on property: has part
  some values from: mouth
subclass of: Restriction
  on property: has foot shape
  some values from: cylindrical legs
subclass of: Class
  complement of: Restriction
    on property: has part
    some values from: slanting shoulder
subclass of: Restriction
  on property: has ear direction
  some values from: Straight
subclass of: Restriction
  on property: has belly shape
  some values from: oblong body
subclass of: Class
  complement of: Restriction
    on property: has mouth
    some values from: StraightLipServingAsTenon
subclass of: Restriction
  on property: has part
  some values from: ears
subclass of: Class
  complement of: Restriction
    on property: has part
    some values from: door
subclass of: Class
  complement of: Restriction
    on property: has foot
    some values from: slender and spreading legs
subclass of: Restriction
  on property: has foot number
  some values from: four foot
subclass of: Restriction
  on property: has mouth shape
  some values from: oblong mouth
subclass of: Class
  complement of: Restriction
    on property: has part
    some values from: spout
subclass of: Class
  complement of: Restriction
    on property: has part
    some values from: constricted waist
subclass of: Restriction
  on property: has ear location
  some values from: on the rim
subclass of: Class
  complement of: Restriction
    on property: has part
    some values from: Tri-lobedBottom
subclass of: Restriction
  on property: has bottom shape
  some values from: slightly bulging bottom
subclass of: Class
  complement of: Restriction
    on property: has part
    some values from: lid
subclass of: Class
  complement of: Restriction
    on property: has mouth
    some values from: small mouth
subclass of: Restriction
  on property: has ear shape
  some values from: VerticalEars
concept name: <Ding without lid not straight lip serving as tenon not small mouth oblong mouth without door without swing-handle without spout without single handle with ears vertical ears on the rim straight not constricted neck not slanting shoulder not constricted waist oblong body sagging belly not tri-lobed slightly bulging bottom four legs cylindrical legs not slender and spreading legs>
definition: Ding with oblong mouth,straight vertical ears on the rim,oblong body,sagging belly,slightly bulging bottom and four cylindrical legs
preferred label: 柱足椭方鼎3 @zh
definition: 鼎带椭方形口，竖直立耳在口沿上，椭方体，垂腹，近平底，四柱足 @zh

Cylindrical-legged Oblong Ding 4
type: Class
subclass of: ding
subclass of: Restriction
  on property: has part
  some values from: lid
subclass of: Restriction
  on property: has bottom shape
  some values from: slightly bulging bottom
subclass of: Restriction
  on property: has belly shape
  some values from: oblong body
subclass of: Restriction
  on property: has foot number
  some values from: four foot
subclass of: Restriction
  on property: has ear location
  some values from: UnderTheRim
subclass of: Restriction
  on property: has part
  some values from: foot
subclass of: Restriction
  on property: has part
  some values from: StraightLipServingAsTenon
subclass of: Restriction
  on property: has part
  some values from: ears
subclass of: Restriction
  on property: has mouth shape
  some values from: oblong mouth
subclass of: Restriction
  on property: has ear direction
  some values from: Straight
subclass of: Restriction
  on property: has belly wall
  some values from: bulging belly
subclass of: Restriction
  on property: has part
  some values from: bottom
subclass of: Restriction
  on property: has ear shape
  some values from: side ears
subclass of: Restriction
  on property: has part
  some values from: constricted neck
subclass of: Restriction
  on property: has foot shape
  some values from: cylindrical legs
concept name: <Ding with lid straight lip serving as tenon not small mouth oblong mouth without door without swing-handle without spout without single handle with ears side ears under the rim straight constricted neck not slanting shoulder not constricted waist oblong body bulging belly not tri-lobed slightly bulging bottom four legs cylindrical legs not slender and spreading legs>
definition: Ding with lid,straight lip serving as tenon,oblong mouth,straight side ears under the rim,constricted neck,oblong body,bulging belly,slightly bulging bottom and four cylindrical legs
preferred label: 柱足椭方鼎4 @zh
definition: 鼎带盖，子母口，椭方形口，竖直附耳在口沿下，束颈，椭方体，鼓腹，近平底，四柱足 @zh

Cylindrical-legged Oblong Ding 5
type: Class
subclass of: ding
subclass of: Class
  complement of: Restriction
    on property: has part
    some values from: constricted waist
subclass of: Class
  complement of: Restriction
    on property: has mouth
    some values from: StraightLipServingAsTenon
subclass of: Restriction
  on property: has foot number
  some values from: four foot
subclass of: Restriction
  on property: has bottom shape
  some values from: slightly bulging bottom
subclass of: Restriction
  on property: has belly shape
  some values from: oblong body
subclass of: Restriction
  on property: has part
  some values from: foot
subclass of: Restriction
  on property: has part
  some values from: constricted neck
subclass of: Restriction
  on property: has part
  some values from: ears
subclass of: Restriction
  on property: has part
  some values from: mouth
subclass of: Restriction
  on property: has ear direction
  some values from: Straight
subclass of: Class
  complement of: Restriction
    on property: has part
    some values from: door
subclass of: Class
  complement of: Restriction
    on property: has foot
    some values from: slender and spreading legs
subclass of: Restriction
  on property: has belly wall
  some values from: bulging belly
subclass of: Restriction
  on property: has part
  some values from: belly
subclass of: Restriction
  on property: has part
  some values from: bottom
subclass of: Restriction
  on property: has mouth shape
  some values from: oblong mouth
subclass of: Class
  complement of: Restriction
    on property: has part
    some values from: single handle
subclass of: Class
  complement of: Restriction
    on property: has part
    some values from: Swing-handle
subclass of: Restriction
  on property: has ear location
  some values from: on the rim
subclass of: Class
  complement of: Restriction
    on property: has part
    some values from: Tri-lobedBottom
subclass of: Restriction
  on property: has ear shape
  some values from: VerticalEars
subclass of: Class
  complement of: Restriction
    on property: has part
    some values from: spout
subclass of: Restriction
  on property: has part
  some values from: slanting shoulder
subclass of: Class
  complement of: Restriction
    on property: has mouth
    some values from: small mouth
subclass of: Restriction
  on property: has foot shape
  some values from: cylindrical legs
concept name: <Ding without lid not straight lip serving as tenon not small mouth oblong mouth without door without swing-handle without spout without single handle with ears vertical ears on the rim straight constricted neck slanting shoulder not constricted waist oblong body bulging belly not tri-lobed slightly bulging bottom four legs cylindrical legs not slender and spreading legs>
definition: Ding with oblong mouth,straight vertical ears on the rim,constricted neck,slanting shoulder,oblong body,bulging belly,slightly bulging bottom and four cylindrical legs
preferred label: 柱足椭方鼎5 @zh
definition: 鼎带椭方形口，竖直立耳在口沿上，束颈，溜肩，椭方体，鼓腹，近平底，四柱足 @zh

Cylindrical-legged Oblong Ding 6
type: Class
subclass of: ding
subclass of: Class
  complement of: Restriction
    on property: has part
    some values from: door
subclass of: Class
  complement of: Restriction
    on property: has part
    some values from: spout
subclass of: Restriction
  on property: has mouth shape
  some values from: oblong mouth
subclass of: Restriction
  on property: has belly shape
  some values from: oblong body
subclass of: Restriction
  on property: has ear location
  some values from: on the rim
subclass of: Restriction
  on property: has part
  some values from: foot
subclass of: Class
  complement of: Restriction
    on property: has foot
    some values from: slender and spreading legs
subclass of: Class
  complement of: Restriction
    on property: has part
    some values from: slanting shoulder
subclass of: Restriction
  on property: has ear direction
  some values from: Straight
subclass of: Restriction
  on property: has top shape
  some values from: flat lid
subclass of: Restriction
  on property: has bottom shape
  some values from: slightly bulging bottom
subclass of: Class
  complement of: Restriction
    on property: has part
    some values from: Swing-handle
subclass of: Restriction
  on property: has foot number
  some values from: four foot
subclass of: Class
  complement of: Restriction
    on property: has part
    some values from: constricted neck
subclass of: Class
  complement of: Restriction
    on property: has mouth
    some values from: small mouth
subclass of: Restriction
  on property: has part
  some values from: belly
subclass of: Restriction
  on property: has part
  some values from: bottom
subclass of: Restriction
  on property: has mouth
  some values from: StraightLipServingAsTenon
subclass of: Class
  complement of: Restriction
    on property: has part
    some values from: Tri-lobedBottom
subclass of: Restriction
  on property: has belly wall
  some values from: sagging belly
subclass of: Class
  complement of: Restriction
    on property: has part
    some values from: constricted waist
subclass of: Restriction
  on property: has part
  some values from: ears
subclass of: Restriction
  on property: has part
  some values from: lid
subclass of: Class
  complement of: Restriction
    on property: has part
    some values from: single handle
subclass of: Restriction
  on property: has foot shape
  some values from: cylindrical legs
subclass of: Restriction
  on property: has ear shape
  some values from: VerticalEars
concept name: <Ding with lid flat lid straight lip serving as tenon not small mouth oblong mouth without door without swing-handle without spout without single handle with ears vertical ears on the rim straight not constricted neck not slanting shoulder not constricted waist oblong body sagging belly not tri-lobed slightly bulging bottom four legs cylindrical legs not slender and spreading legs>
definition: Ding with flat lid,straight lip serving as tenon,oblong mouth,straight vertical ears on the rim,oblong body,sagging belly,slightly bulging bottom and four cylindrical legs
preferred label: 柱足椭方鼎6 @zh
definition: 鼎带盖，平顶，子母口，椭方形口，竖直立耳口沿上，椭方体，垂腹，近平底，四柱足 @zh

Cylindrical-legged Oblong Ding 7
type: Class
subclass of: ding
subclass of: Restriction
  on property: has bottom shape
  some values from: slightly bulging bottom
subclass of: Restriction
  on property: has ear location
  some values from: UnderTheRim
subclass of: Restriction
  on property: has mouth shape
  some values from: oblong mouth
subclass of: Restriction
  on property: has foot shape
  some values from: cylindrical legs
subclass of: Class
  complement of: Restriction
    on property: has part
    some values from: lid
subclass of: Restriction
  on property: has belly shape
  some values from: oblong body
subclass of: Restriction
  on property: has part
  some values from: bottom
subclass of: Restriction
  on property: has part
  some values from: foot
subclass of: Class
  complement of: Restriction
    on property: has part
    some values from: door
subclass of: Class
  complement of: Restriction
    on property: has foot
    some values from: slender and spreading legs
subclass of: Class
  complement of: Restriction
    on property: has mouth
    some values from: small mouth
subclass of: Class
  complement of: Restriction
    on property: has part
    some values from: Tri-lobedBottom
subclass of: Class
  complement of: Restriction
    on property: has part
    some values from: spout
subclass of: Restriction
  on property: has part
  some values from: ears
subclass of: Class
  complement of: Restriction
    on property: has part
    some values from: Swing-handle
subclass of: Class
  complement of: Restriction
    on property: has part
    some values from: constricted waist
subclass of: Restriction
  on property: has belly wall
  some values from: bulging belly
subclass of: Restriction
  on property: has part
  some values from: constricted neck
subclass of: Class
  complement of: Restriction
    on property: has mouth
    some values from: StraightLipServingAsTenon
subclass of: Restriction
  on property: has part
  some values from: single handle
subclass of: Restriction
  on property: has foot number
  some values from: four foot
subclass of: Restriction
  on property: has ear direction
  some values from: Straight
subclass of: Restriction
  on property: has ear shape
  some values from: side ears
subclass of: Restriction
  on property: has part
  some values from: belly
subclass of: Restriction
  on property: has part
  some values from: mouth
subclass of: Class
  complement of: Restriction
    on property: has part
    some values from: slanting shoulder
concept name: <Ding without lid not straight lip serving as tenon not small mouth oblong mouth without door without swing-handle without spout with single handle with ears side ears under the rim straight constricted neck not slanting shoulder not constricted waist oblong body bulging belly not tri-lobed slightly bulging bottom four legs cylindrical legs not slender and spreading legs>
definition: Ding with oblong mouth,single handle,straight side ears under the rim,constricted neck,oblong body,bulging belly,slightly bulging bottom and four cylindrical legs
preferred label: 柱足椭方鼎7 @zh
definition: 鼎带椭方形口，带鋬，竖直附耳在口沿下，束颈，椭方体，鼓腹，近平底，四柱足 @zh

Cylindrical-legged Oblong Ding 8
type: Class
subclass of: ding
subclass of: Class
  complement of: Restriction
    on property: has part
    some values from: single handle
subclass of: Restriction
  on property: has bottom shape
  some values from: flat bottom
subclass of: Restriction
  on property: has part
  some values from: ears
subclass of: Restriction
  on property: has ear direction
  some values from: Straight
subclass of: Restriction
  on property: has mouth shape
  some values from: oblong mouth
subclass of: Class
  complement of: Restriction
    on property: has part
    some values from: Swing-handle
subclass of: Class
  complement of: Restriction
    on property: has mouth
    some values from: small mouth
subclass of: Restriction
  on property: has mouth
  some values from: StraightLipServingAsTenon
subclass of: Restriction
  on property: has part
  some values from: bottom
subclass of: Restriction
  on property: has ear location
  some values from: UnderTheRim
subclass of: Restriction
  on property: has part
  some values from: lid
subclass of: Restriction
  on property: has foot shape
  some values from: cylindrical legs
subclass of: Class
  complement of: Restriction
    on property: has part
    some values from: constricted waist
subclass of: Class
  complement of: Restriction
    on property: has part
    some values from: spout
subclass of: Restriction
  on property: has belly shape
  some values from: oblong body
subclass of: Restriction
  on property: has part
  some values from: belly
subclass of: Class
  complement of: Restriction
    on property: has part
    some values from: slanting shoulder
subclass of: Restriction
  on property: has top shape
  some values from: flat lid
subclass of: Class
  complement of: Restriction
    on property: has part
    some values from: Tri-lobedBottom
subclass of: Restriction
  on property: has belly wall
  some values from: sagging belly
subclass of: Class
  complement of: Restriction
    on property: has part
    some values from: constricted neck
subclass of: Restriction
  on property: has ear shape
  some values from: side ears
subclass of: Restriction
  on property: has foot number
  some values from: four foot
subclass of: Restriction
  on property: has part
  some values from: foot
subclass of: Class
  complement of: Restriction
    on property: has foot
    some values from: slender and spreading legs
subclass of: Class
  complement of: Restriction
    on property: has part
    some values from: door
concept name: <Ding with lid flat lid straight lip serving as tenon not small mouth oblong mouth without door without swing-handle without spout without single handle with ears side ears under the rim straight not constricted neck not slanting shoulder not constricted waist oblong body sagging belly not tri-lobed flat bottom four legs cylindrical legs not slender and spreading legs>
definition: Ding with flat lid,straight lip serving as tenon,oblong mouth,straight side ears under the rim,oblong body,sagging belly,flat bottom and four cylindrical legs
preferred label: 柱足椭方鼎8 @zh
definition: 鼎带盖，平顶，子母口，椭方形口，竖直附耳在口沿下，椭方体，垂腹，平底，四柱足 @zh

Cylindrical-legged Oblong Ding 9
type: Class
subclass of: ding
subclass of: Class
  complement of: Restriction
    on property: has part
    some values from: Swing-handle
subclass of: Class
  complement of: Restriction
    on property: has part
    some values from: spout
subclass of: Restriction
  on property: has top shape
  some values from: domed lid
subclass of: Restriction
  on property: has part
  some values from: belly
subclass of: Restriction
  on property: has belly wall
  some values from: sagging belly
subclass of: Class
  complement of: Restriction
    on property: has part
    some values from: door
subclass of: Class
  complement of: Restriction
    on property: has foot
    some values from: slender and spreading legs
subclass of: Restriction
  on property: has part
  some values from: ears
subclass of: Restriction
  on property: has belly shape
  some values from: oblong body
subclass of: Restriction
  on property: has foot number
  some values from: four foot
subclass of: Restriction
  on property: has foot shape
  some values from: cylindrical legs
subclass of: Restriction
  on property: has part
  some values from: foot
subclass of: Restriction
  on property: has mouth
  some values from: StraightLipServingAsTenon
subclass of: Class
  complement of: Restriction
    on property: has part
    some values from: Tri-lobedBottom
subclass of: Restriction
  on property: has ear location
  some values from: UnderTheRim
subclass of: Restriction
  on property: has mouth shape
  some values from: oblong mouth
subclass of: Class
  complement of: Restriction
    on property: has part
    some values from: slanting shoulder
subclass of: Class
  complement of: Restriction
    on property: has part
    some values from: constricted neck
subclass of: Restriction
  on property: has part
  some values from: lid
subclass of: Restriction
  on property: has ear shape
  some values from: side ears
subclass of: Restriction
  on property: has part
  some values from: bottom
subclass of: Restriction
  on property: has bottom shape
  some values from: slightly bulging bottom
subclass of: Restriction
  on property: has ear direction
  some values from: Straight
subclass of: Class
  complement of: Restriction
    on property: has mouth
    some values from: small mouth
subclass of: Class
  complement of: Restriction
    on property: has part
    some values from: constricted waist
subclass of: Class
  complement of: Restriction
    on property: has part
    some values from: single handle
concept name: <Ding with lid domed lid straight lip serving as tenon not small mouth oblong mouth without door without swing-handle without spout without single handle with ears side ears under the rim straight not constricted neck not slanting shoulder not constricted waist oblong body sagging belly not tri-lobed slightly bulging bottom four legs cylindrical legs not slender and spreading legs>
definition: Ding with domed lid,straight lip serving as tenon,oblong mouth,straight side ears under the rim,oblong body,sagging belly,slightly bulging bottom and four cylindrical legs
preferred label: 柱足椭方鼎9 @zh
definition: 鼎带盖，圜顶，子母口，椭方形口，竖直附耳在口沿下，椭方体，垂腹，近平底，四柱足 @zh

Cylindrical-legged Pending with Side Ears
type: Class
subclass of: ding
subclass of: Restriction
  on property: has ear shape
  some values from: side ears
subclass of: Restriction
  on property: has part
  some values from: ears
subclass of: Restriction
  on property: has part
  some values from: foot
subclass of: Class
  complement of: Restriction
    on property: has part
    some values from: constricted neck
subclass of: Restriction
  on property: has ear direction
  some values from: Straight
subclass of: Restriction
  on property: has foot shape
  some values from: cylindrical legs
subclass of: Class
  complement of: Restriction
    on property: has part
    some values from: Swing-handle
subclass of: Class
  complement of: Restriction
    on property: has part
    some values from: Tri-lobedBottom
subclass of: Restriction
  on property: has mouth shape
  some values from: circular mouth
subclass of: Class
  complement of: Restriction
    on property: has part
    some values from: single handle
subclass of: Restriction
  on property: has ear location
  some values from: UnderTheRim
subclass of: Class
  complement of: Restriction
    on property: has part
    some values from: door
subclass of: Restriction
  on property: has belly shape
  some values from: round body
subclass of: Restriction
  on property: has part
  some values from: bottom
subclass of: Class
  complement of: Restriction
    on property: has mouth
    some values from: small mouth
subclass of: Class
  complement of: Restriction
    on property: has part
    some values from: spout
subclass of: Class
  complement of: Restriction
    on property: has foot
    some values from: slender and spreading legs
concept name: <Ding not small mouth circular mouth without door without swing-handle without spout without single handle with ears side ears under the rim straight not constricted neck not slanting shoulder not constricted waist round body not tri-lobed cylindrical legs not slender and spreading legs>
definition: Ding with circular mouth,straight side ears under the rim,round body,and cylindrical legs
preferred label: 附耳柱足盆鼎 @zh
definition: 鼎圆形口，竖直附耳在口沿下，圆体，柱足 @zh

Cylindrical-legged Pending with Side Ears 1
type: Class
subclass of: Cylindrical-legged Pending with Side Ears
subclass of: Restriction
  on property: has mouth
  some values from: StraightLipServingAsTenon
subclass of: Restriction
  on property: has bottom shape
  some values from: bulging bottom
subclass of: Restriction
  on property: has part
  some values from: lid
subclass of: Restriction
  on property: has foot number
  some values from: ThreeFoot
subclass of: Restriction
  on property: has top shape
  some values from: domed lid
subclass of: Restriction
  on property: has belly wall
  some values from: bulging belly
concept name: <Cylindrical-legged Pending with Side Ears with lid domed lid straight lip serving as tenon bulging belly bulging bottom three legs>
definition: Cylindrical-legged Pending with Side Ears with domed lid,straight lip serving as tenon,bulging belly,bulging bottom and three legs
preferred label: 附耳柱足盆鼎1 @zh
definition: 鼎带盖，圜顶，子母口，鼓腹，圜底，三足 @zh

Cylindrical-legged Pending with Side Ears 3
type: Class
subclass of: Cylindrical-legged Pending with Side Ears
subclass of: Restriction
  on property: has belly wall
  some values from: sagging belly
subclass of: Class
  complement of: Restriction
    on property: has part
    some values from: lid
subclass of: Class
  complement of: Restriction
    on property: has mouth
    some values from: StraightLipServingAsTenon
subclass of: Restriction
  on property: has foot number
  some values from: four foot
subclass of: Restriction
  on property: has bottom shape
  some values from: slightly bulging bottom
concept name: <Cylindrical-legged Pending with Side Ears without lid not straight lip serving as tenon sagging belly slightly bulging bottom four legs>
definition: Cylindrical-legged Pending with Side Ears with sagging belly,slightly bulging bottom and four legs
preferred label: 附耳柱足盆鼎3 @zh
definition: 附耳柱足盆鼎带垂腹，近平底，四足 @zh

Cylindrical-legged Pending with Side Ears 5
type: Class
subclass of: Cylindrical-legged Pending with Side Ears
subclass of: Class
  complement of: Restriction
    on property: has part
    some values from: lid
subclass of: Restriction
  on property: has bottom shape
  some values from: bulging bottom
subclass of: Class
  complement of: Restriction
    on property: has mouth
    some values from: StraightLipServingAsTenon
subclass of: Restriction
  on property: has foot number
  some values from: ThreeFoot
subclass of: Restriction
  on property: has belly wall
  some values from: bulging belly
concept name: <Cylindrical-legged Pending with Side Ears without lid not straight lip serving as tenon bulging belly bulging bottom three legs>
definition: Cylindrical-legged Pending with Side Ears with bulging belly,bulging bottom and three legs
preferred label: 附耳柱足盆鼎5 @zh
definition: 附耳柱足盆鼎带鼓腹，圜底，三足 @zh

Cylindrical-legged Pending with Side Ears 6
type: Class
subclass of: Cylindrical-legged Pending with Side Ears
subclass of: Restriction
  on property: has bottom shape
  some values from: bulging bottom
subclass of: Restriction
  on property: has top shape
  some values from: flat lid
subclass of: Restriction
  on property: has foot number
  some values from: ThreeFoot
subclass of: Restriction
  on property: has belly wall
  some values from: bulging belly
subclass of: Restriction
  on property: has part
  some values from: lid
concept name: <Cylindrical-legged Pending with Side Ears with lid flat lid straight lip serving as tenon bulging belly bulging bottom three legs>
definition: Cylindrical-legged Pending with Side Ears with flat lid,straight lip serving as tenon,bulging belly,bulging bottom and three legs
preferred label: 附耳柱足盆鼎6 @zh
definition: 附耳柱足盆鼎带盖，平顶，子母口，鼓腹，圜底，三足 @zh

Cylindrical-legged Pending with Side Ears 7
type: Class
subclass of: Cylindrical-legged Pending with Side Ears
subclass of: Restriction
  on property: has top shape
  some values from: domed lid
subclass of: Restriction
  on property: has mouth
  some values from: StraightLipServingAsTenon
subclass of: Restriction
  on property: has part
  some values from: lid
subclass of: Restriction
  on property: has foot number
  some values from: ThreeFoot
subclass of: Restriction
  on property: has bottom shape
  some values from: bulging bottom
subclass of: Restriction
  on property: has belly wall
  some values from: sagging belly
concept name: <Cylindrical-legged Pending with Side Ears with lid domed lid straight lip serving as tenon sagging belly bulging bottom three legs>
definition: Ding with domed lid,straight lip serving as tenon,sagging belly,bulging bottom and three legs
preferred label: 附耳柱足盆鼎7 @zh
definition: 附耳柱足盆鼎带盖，圜顶，子母口，垂腹，圜底，三足 @zh

Cylindrical-legged Pending with Side Ears 9
type: Class
subclass of: Cylindrical-legged Pending with Side Ears
subclass of: Restriction
  on property: has belly wall
  some values from: sagging belly
subclass of: Restriction
  on property: has foot number
  some values from: ThreeFoot
subclass of: Class
  complement of: Restriction
    on property: has mouth
    some values from: StraightLipServingAsTenon
subclass of: Class
  complement of: Restriction
    on property: has part
    some values from: lid
subclass of: Restriction
  on property: has bottom shape
  some values from: slightly bulging bottom
concept name: <Cylindrical-legged Pending with Side Ears without lid not straight lip serving as tenon sagging belly slightly bulging bottom three legs>
definition: Cylindrical-legged Pending with Side Ears with sagging belly,slightly bulging bottom and three legs
preferred label: 附耳柱足盆鼎9 @zh
definition: 附耳柱足盆鼎带垂腹，近平底，三足 @zh

Cylindrical-legged Pending with Vertical Ears
type: Class
subclass of: ding
subclass of: Class
  complement of: Restriction
    on property: has mouth
    some values from: StraightLipServingAsTenon
subclass of: Class
  complement of: Restriction
    on property: has foot
    some values from: slender and spreading legs
subclass of: Restriction
  on property: has foot shape
  some values from: cylindrical legs
subclass of: Class
  complement of: Restriction
    on property: has part
    some values from: Tri-lobedBottom
subclass of: Class
  complement of: Restriction
    on property: has part
    some values from: slanting shoulder
subclass of: Restriction
  on property: has belly shape
  some values from: round body
subclass of: Class
  complement of: Restriction
    on property: has mouth
    some values from: small mouth
subclass of: Class
  complement of: Restriction
    on property: has part
    some values from: constricted neck
subclass of: Restriction
  on property: has foot number
  some values from: ThreeFoot
subclass of: Restriction
  on property: has ear location
  some values from: on the rim
subclass of: Restriction
  on property: has ear shape
  some values from: VerticalEars
subclass of: Class
  complement of: Restriction
    on property: has part
    some values from: constricted waist
subclass of: Restriction
  on property: has mouth shape
  some values from: circular mouth
concept name: <Ding not straight lip serving as tenon not small mouth circular mouth without swing-handle without spout without single handle with ears on the rim spreading not constricted neck not slanting shoulder not constricted waist round body not tri-lobed three legs cylindrical legs not slender and spreading legs>
definition: Ding with circular mouth,vertical ears on the rim,round body,and three cylindrical legs
preferred label: 立耳柱足盆鼎 @zh
definition: 鼎圆形口，立耳在口沿上，圆体，三柱足 @zh

Cylindrical-legged Pending with Vertical Ears 1
type: Class
subclass of: Cylindrical-legged Pending with Vertical Ears
subclass of: Restriction
  on property: has ear direction
  some values from: Spreading
subclass of: Class
  complement of: Restriction
    on property: has part
    some values from: lid
subclass of: Restriction
  on property: has belly wall
  some values from: bulging belly
concept name: <Cylindrical-legged Pending with Vertical Ears without lid without door with spreading ears bulging belly bulging bottom >
definition: Cylindrical-legged Pending with Vertical Ears with spreading ears,bulging belly,bulging bottom
preferred label: 立耳柱足盆鼎1 @zh
definition: 立耳柱足盆鼎带外撇耳，鼓腹，圜底 @zh

Cylindrical-legged Pending with Vertical Ears 10
type: Class
subclass of: Cylindrical-legged Pending with Vertical Ears
subclass of: Restriction
  on property: has ear direction
  some values from: Straight
subclass of: Restriction
  on property: has bottom shape
  some values from: bulging bottom
subclass of: Restriction
  on property: has top shape
  some values from: domed lid
subclass of: Restriction
  on property: has part
  some values from: lid
subclass of: Restriction
  on property: has belly wall
  some values from: sagging belly
concept name: <Cylindrical-legged Pending with Vertical Ears with lid domed lid without door with straight ears sagging belly bulging bottom>
definition: Cylindrical-legged Pending with Vertical Ears with domed lid,straight ears,sagging belly,and bulging bottom
preferred label: 立耳柱足盆鼎10 @zh
definition: 立耳柱足盆鼎带盖，圜顶，竖直耳，垂腹，圜底 @zh

Cylindrical-legged Pending with Vertical Ears 2
type: Class
subclass of: Cylindrical-legged Pending with Vertical Ears
subclass of: Restriction
  on property: has belly wall
  some values from: bulging belly
subclass of: Restriction
  on property: has ear direction
  some values from: Straight
subclass of: Restriction
  on property: has bottom shape
  some values from: slightly bulging bottom
concept name: <Cylindrical-legged Pending with Vertical Ears without lid without door with straight ears bulging belly slightly bulging bottom>
definition: Cylindrical-legged Pending with Vertical Ears with straight ears,bulging belly and slightly bulging bottom
preferred label: 立耳柱足盆鼎2 @zh
definition: 立耳柱足盆鼎带竖直耳，鼓腹，近平底 @zh

Cylindrical-legged Pending with Vertical Ears 3
type: Class
subclass of: Cylindrical-legged Pending with Vertical Ears
subclass of: Restriction
  on property: has ear direction
  some values from: Straight
subclass of: Restriction
  on property: has bottom shape
  some values from: bulging bottom
subclass of: Restriction
  on property: has belly wall
  some values from: bulging belly
concept name: <Cylindrical-legged Pending with Vertical Ears without lid with door with straight ears bulging belly, bulging bottom>
definition: Cylindrical-legged Pending with Vertical Ears with door,straight ears,bulging belly,bulging bottom
preferred label: 立耳柱足盆鼎3 @zh
definition: 立耳柱足盆鼎带门，竖直耳，鼓腹，圜底 @zh

Cylindrical-legged Pending with Vertical Ears 4
type: Class
subclass of: Cylindrical-legged Pending with Vertical Ears
subclass of: Restriction
  on property: has ear direction
  some values from: Straight
subclass of: Restriction
  on property: has bottom shape
  some values from: bulging bottom
subclass of: Restriction
  on property: has belly wall
  some values from: bulging belly
concept name: <Cylindrical-legged Pending with Vertical Ears without lid without door with straight ears bulging belly bulging bottom>
definition: Cylindrical-legged Pending with Vertical Ears with straight ears,bulging belly,bulging bottom
preferred label: 立耳柱足盆鼎4 @zh
definition: 立耳柱足盆鼎带竖直耳，鼓腹，圜底 @zh

Cylindrical-legged Pending with Vertical Ears 5
type: Class
subclass of: Cylindrical-legged Pending with Vertical Ears
subclass of: Restriction
  on property: has bottom shape
  some values from: bulging bottom
subclass of: Restriction
  on property: has ear direction
  some values from: Straight
subclass of: Restriction
  on property: has belly wall
  some values from: bulging belly tapering downwards
concept name: <Cylindrical-legged Pending with Vertical Ears without lid without door with straight ears bulging belly tapering downwards bulging bottom>
definition: Cylindrical-legged Pending with Vertical Ears with straight ears,bulging belly tapering downwards and bulging bottom
preferred label: 立耳柱足盆鼎5 @zh
definition: 立耳柱足盆鼎带竖直耳，敛腹，圜底 @zh

Cylindrical-legged Pending with Vertical Ears 6
type: Class
subclass of: Cylindrical-legged Pending with Vertical Ears
subclass of: Restriction
  on property: has belly wall
  some values from: sagging belly
subclass of: Restriction
  on property: has bottom shape
  some values from: bulging bottom
subclass of: Restriction
  on property: has ear direction
  some values from: Straight
concept name: <Cylindrical-legged Pending with Vertical Ears without lid without door with straight ears sagging belly bulging bottom>
definition: Cylindrical-legged Pending with Vertical Ears with straight ears,sagging belly, and bulging bottom
preferred label: 立耳柱足盆鼎6 @zh
definition: 立耳柱足盆鼎带竖直耳，垂腹，圜底 @zh

Cylindrical-legged Pending with Vertical Ears 7
type: Class
subclass of: Cylindrical-legged Pending with Vertical Ears
subclass of: Restriction
  on property: has bottom shape
  some values from: slightly bulging bottom
subclass of: Restriction
  on property: has ear direction
  some values from: Straight
subclass of: Restriction
  on property: has belly wall
  some values from: StraightBelly
concept name: <Cylindrical-legged Pending with Vertical Ears without lid without door with straight ears straight belly slightly bulging bottom>
definition: Cylindrical-legged Pending with Vertical Ears with straight ears,straight belly and slightly bulging bottom
preferred label: 立耳柱足盆鼎7 @zh
definition: 立耳柱足盆鼎带竖直耳，直腹，近平底 @zh

Cylindrical-legged Pending with Vertical Ears 8
type: Class
subclass of: Cylindrical-legged Pending with Vertical Ears
subclass of: Restriction
  on property: has belly wall
  some values from: StraightBelly
subclass of: Restriction
  on property: has ear direction
  some values from: Straight
concept name: <Cylindrical-legged Pending with Vertical Ears without lid without door with ears straight straight belly bulging bottom>
definition: Cylindrical-legged Pending with Vertical Ears with straight ears,straight belly and bulging bottom
preferred label: 立耳柱足盆鼎8 @zh
definition: 立耳柱足盆鼎带竖直耳，直腹，圜底 @zh

Cylindrical-legged Pending with Vertical Ears 9
type: Class
subclass of: Cylindrical-legged Pending with Vertical Ears
subclass of: Restriction
  on property: has belly wall
  some values from: sagging belly
subclass of: Restriction
  on property: has ear direction
  some values from: Straight
subclass of: Restriction
  on property: has bottom shape
  some values from: slightly bulging bottom
concept name: <Cylindrical-legged Pending with Vertical Ears without lid without door with straight ears sagging belly slightly bulging bottom>
definition: Cylindrical-legged Pending with Vertical Ears with straight ears,sagging belly,slightly bulging bottom
preferred label: 立耳柱足盆鼎9 @zh
definition: 立耳柱足盆鼎带竖直耳，垂腹，近平底 @zh

Cylindrical-legged Rectangular Ding 1
type: Class
subclass of: ding
subclass of: Class
  complement of: Restriction
    on property: has mouth
    some values from: small mouth
subclass of: Restriction
  on property: has part
  some values from: constricted neck
subclass of: Restriction
  on property: has ear direction
  some values from: Straight
subclass of: Class
  complement of: Restriction
    on property: has part
    some values from: Swing-handle
subclass of: Class
  complement of: Restriction
    on property: has part
    some values from: slanting shoulder
subclass of: Class
  complement of: Restriction
    on property: has part
    some values from: door
subclass of: Class
  complement of: Restriction
    on property: has part
    some values from: Tri-lobedBottom
subclass of: Class
  complement of: Restriction
    on property: has part
    some values from: single handle
subclass of: Restriction
  on property: has belly wall
  some values from: StraightBelly
subclass of: Restriction
  on property: has foot number
  some values from: four foot
subclass of: Restriction
  on property: has ear shape
  some values from: side ears
subclass of: Class
  complement of: Restriction
    on property: has foot
    some values from: slender and spreading legs
subclass of: Restriction
  on property: has ear location
  some values from: UnderTheRim
subclass of: Restriction
  on property: has part
  some values from: foot
subclass of: Class
  complement of: Restriction
    on property: has part
    some values from: lid
subclass of: Restriction
  on property: has part
  some values from: mouth
subclass of: Restriction
  on property: has foot shape
  some values from: cylindrical legs
subclass of: Class
  complement of: Restriction
    on property: has part
    some values from: spout
subclass of: Class
  complement of: Restriction
    on property: has mouth
    some values from: StraightLipServingAsTenon
subclass of: Restriction
  on property: has mouth shape
  some values from: rectangular mouth
subclass of: Restriction
  on property: has part
  some values from: ears
subclass of: Restriction
  on property: has belly shape
  some values from: rectangular body
subclass of: Class
  complement of: Restriction
    on property: has part
    some values from: constricted waist
subclass of: Restriction
  on property: has bottom shape
  some values from: flat bottom
subclass of: Restriction
  on property: has part
  some values from: bottom
concept name: <Ding without lid not straight lip serving as tenon not small mouth rectangular mouth without door without swing-handle without spout without single handle with ears side ears under the rim straight constricted neck not slanting shoulder not constricted waist rectangular body straight belly not tri-lobed flat bottom four legs cylindrical legs not slender and spreading legs>
alternative label: Cylindrical-legged Fangding 1
definition: Ding with rectangular mouth,straight side ears under the rim,constricted neck,rectangular body,straight belly,flat bottom and four cylindrical legs
preferred label: 柱足方鼎1 @zh
definition: 鼎带长方形口，竖直附耳在口沿下，束颈，长方体，直腹，平底，四柱足 @zh

Cylindrical-legged Rectangular Ding 2
type: Class
subclass of: ding
subclass of: Class
  complement of: Restriction
    on property: has mouth
    some values from: small mouth
subclass of: Class
  complement of: Restriction
    on property: has part
    some values from: lid
subclass of: Restriction
  on property: has part
  some values from: belly
subclass of: Restriction
  on property: has ear direction
  some values from: Straight
subclass of: Class
  complement of: Restriction
    on property: has foot
    some values from: slender and spreading legs
subclass of: Restriction
  on property: has ear shape
  some values from: side ears
subclass of: Restriction
  on property: has part
  some values from: mouth
subclass of: Restriction
  on property: has mouth shape
  some values from: rectangular mouth
subclass of: Restriction
  on property: has part
  some values from: bottom
subclass of: Restriction
  on property: has part
  some values from: foot
subclass of: Restriction
  on property: has foot number
  some values from: ThreeFoot
subclass of: Class
  complement of: Restriction
    on property: has part
    some values from: door
subclass of: Class
  complement of: Restriction
    on property: has part
    some values from: constricted waist
subclass of: Class
  complement of: Restriction
    on property: has part
    some values from: slanting shoulder
subclass of: Class
  complement of: Restriction
    on property: has part
    some values from: Swing-handle
subclass of: Class
  complement of: Restriction
    on property: has mouth
    some values from: StraightLipServingAsTenon
subclass of: Restriction
  on property: has part
  some values from: constricted neck
subclass of: Restriction
  on property: has ear location
  some values from: UnderTheRim
subclass of: Restriction
  on property: has belly wall
  some values from: bulging belly
subclass of: Class
  complement of: Restriction
    on property: has part
    some values from: single handle
subclass of: Restriction
  on property: has bottom shape
  some values from: flat bottom
subclass of: Restriction
  on property: has belly shape
  some values from: rectangular body
subclass of: Restriction
  on property: has foot shape
  some values from: cylindrical legs
subclass of: Class
  complement of: Restriction
    on property: has part
    some values from: spout
subclass of: Class
  complement of: Restriction
    on property: has part
    some values from: Tri-lobedBottom
subclass of: Restriction
  on property: has part
  some values from: ears
concept name: <Ding without lid not straight lip serving as tenon not small mouth rectangular mouth without door without swing-handle without spout without single handle with ears side ears under the rim straight constricted neck not slanting shoulder not constricted waist rectangular body bulging belly not tri-lobed flat bottom four legs cylindrical legs not slender and spreading legs>
alternative label: Cylindrical-legged Fangding 2
definition: Ding with rectangular mouth,straight side ears under the rim,constricted neck,rectangular body,bulging belly,flat bottom and four cylindrical legs
preferred label: 柱足方鼎2 @zh
definition: 鼎带长方形口，竖直附耳在口沿下，束颈，长方体，鼓腹，平底，四柱足 @zh

Cylindrical-legged Rectangular Ding 3
type: Class
subclass of: ding
subclass of: Class
  complement of: Restriction
    on property: has part
    some values from: spout
subclass of: Class
  complement of: Restriction
    on property: has foot
    some values from: slender and spreading legs
subclass of: Class
  complement of: Restriction
    on property: has part
    some values from: slanting shoulder
subclass of: Class
  complement of: Restriction
    on property: has part
    some values from: door
subclass of: Class
  complement of: Restriction
    on property: has part
    some values from: Tri-lobedBottom
subclass of: Class
  complement of: Restriction
    on property: has part
    some values from: constricted neck
subclass of: Restriction
  on property: has ear shape
  some values from: VerticalEars
subclass of: Restriction
  on property: has foot shape
  some values from: cylindrical legs
subclass of: Restriction
  on property: has part
  some values from: foot
subclass of: Restriction
  on property: has ear location
  some values from: on the rim
subclass of: Restriction
  on property: has part
  some values from: mouth
subclass of: Restriction
  on property: has belly shape
  some values from: rectangular body
subclass of: Class
  complement of: Restriction
    on property: has mouth
    some values from: StraightLipServingAsTenon
subclass of: Class
  complement of: Restriction
    on property: has part
    some values from: lid
subclass of: Restriction
  on property: has part
  some values from: belly
subclass of: Restriction
  on property: has part
  some values from: bottom
subclass of: Restriction
  on property: has ear direction
  some values from: Straight
subclass of: Restriction
  on property: has foot number
  some values from: four foot
subclass of: Class
  complement of: Restriction
    on property: has mouth
    some values from: small mouth
subclass of: Restriction
  on property: has belly wall
  some values from: StraightBelly
subclass of: Class
  complement of: Restriction
    on property: has part
    some values from: Swing-handle
subclass of: Restriction
  on property: has part
  some values from: ears
subclass of: Restriction
  on property: has bottom shape
  some values from: flat bottom
subclass of: Class
  complement of: Restriction
    on property: has part
    some values from: constricted waist
subclass of: Class
  complement of: Restriction
    on property: has part
    some values from: single handle
subclass of: Restriction
  on property: has mouth shape
  some values from: rectangular mouth
concept name: <Ding without lid not straight lip serving as tenon not small mouth rectangular mouth without door without swing-handle without spout without single handle with ears vertical ears on the rim straight not constricted neck not slanting shoulder not constricted waist rectangular body straight belly not tri-lobed flat bottom four legs cylindrical legs not slender and spreading legs>
alternative label: Cylindrical-legged Fangding 3
definition: Ding with rectangular mouth,straight vertical ears on the rim,rectangular body,straight belly,flat bottom and four cylindrical legs
preferred label: 柱足方鼎3 @zh
definition: 鼎带长方形口，竖直立耳在口沿上，长方体，直腹，平底，四柱足 @zh

Cylindrical-legged Rectangular Ding 4
type: Class
subclass of: ding
subclass of: Class
  complement of: Restriction
    on property: has part
    some values from: single handle
subclass of: Restriction
  on property: has part
  some values from: lid
subclass of: Restriction
  on property: has ear location
  some values from: on the rim
subclass of: Class
  complement of: Restriction
    on property: has mouth
    some values from: StraightLipServingAsTenon
subclass of: Class
  complement of: Restriction
    on property: has part
    some values from: constricted neck
subclass of: Restriction
  on property: has top shape
  some values from: flat lid
subclass of: Restriction
  on property: has mouth
  some values from: mouth
subclass of: Restriction
  on property: has part
  some values from: belly
subclass of: Class
  complement of: Restriction
    on property: has part
    some values from: slanting shoulder
subclass of: Restriction
  on property: has bottom shape
  some values from: flat bottom
subclass of: Class
  complement of: Restriction
    on property: has part
    some values from: door
subclass of: Class
  complement of: Restriction
    on property: has bottom
    some values from: Tri-lobedBottom
subclass of: Restriction
  on property: has belly shape
  some values from: rectangular body
subclass of: Class
  complement of: Restriction
    on property: has foot
    some values from: slender and spreading legs
subclass of: Class
  complement of: Restriction
    on property: has part
    some values from: Swing-handle
subclass of: Restriction
  on property: has belly wall
  some values from: StraightBelly
subclass of: Restriction
  on property: has part
  some values from: bottom
subclass of: Restriction
  on property: has foot shape
  some values from: cylindrical legs
subclass of: Restriction
  on property: has foot number
  some values from: four foot
subclass of: Class
  complement of: Restriction
    on property: has part
    some values from: constricted waist
subclass of: Restriction
  on property: has ear shape
  some values from: VerticalEars
subclass of: Class
  complement of: Restriction
    on property: has part
    some values from: spout
subclass of: Restriction
  on property: has part
  some values from: foot
subclass of: Restriction
  on property: has ear direction
  some values from: Straight
subclass of: Restriction
  on property: has mouth shape
  some values from: rectangular mouth
subclass of: Restriction
  on property: has part
  some values from: ears
subclass of: Class
  complement of: Restriction
    on property: has mouth
    some values from: small mouth
concept name: <Ding with lid flat lid not straight lip serving as tenon not small mouth rectangular mouth without door without swing-handle without spout without single handle with ears vertical ears on the rim straight not constricted neck not slanting shoulder not constricted waist rectangular body straight belly not tri-lobed flat bottom four legs cylindrical legs not slender and spreading legs>
definition: Ding with flat lid,rectangular mouth,straight vertical ears on the rim,rectangular body,straight belly,flat bottom and four cylindrical legs
preferred label: 柱足方鼎4 @zh
definition: 鼎带盖，平顶，长方形口，竖直立耳在口沿上，长方体，直腹，平底，四柱足 @zh

Cylindrical-legged Rectangular Ding 5
type: Class
subclass of: ding
subclass of: Class
  complement of: Restriction
    on property: has mouth
    some values from: small mouth
subclass of: Restriction
  on property: has mouth shape
  some values from: rectangular mouth
subclass of: Restriction
  on property: has ear location
  some values from: on the rim
subclass of: Restriction
  on property: has part
  some values from: foot
subclass of: Restriction
  on property: has belly shape
  some values from: rectangular body
subclass of: Restriction
  on property: has belly wall
  some values from: bulging belly
subclass of: Restriction
  on property: has bottom shape
  some values from: flat bottom
subclass of: Class
  complement of: Restriction
    on property: has mouth
    some values from: StraightLipServingAsTenon
subclass of: Class
  complement of: Restriction
    on property: has bottom
    some values from: Tri-lobedBottom
subclass of: Class
  complement of: Restriction
    on property: has part
    some values from: lid
subclass of: Restriction
  on property: has part
  some values from: bottom
subclass of: Class
  complement of: Restriction
    on property: has part
    some values from: single handle
subclass of: Class
  complement of: Restriction
    on property: has part
    some values from: slanting shoulder
subclass of: Restriction
  on property: has foot shape
  some values from: cylindrical legs
subclass of: Class
  complement of: Restriction
    on property: has foot
    some values from: slender and spreading legs
subclass of: Restriction
  on property: has part
  some values from: mouth
subclass of: Class
  complement of: Restriction
    on property: has part
    some values from: constricted waist
subclass of: Restriction
  on property: has part
  some values from: ears
subclass of: Restriction
  on property: has ear shape
  some values from: VerticalEars
subclass of: Class
  complement of: Restriction
    on property: has part
    some values from: spout
subclass of: Restriction
  on property: has ear direction
  some values from: Straight
subclass of: Restriction
  on property: has foot number
  some values from: four foot
subclass of: Class
  complement of: Restriction
    on property: has part
    some values from: door
subclass of: Restriction
  on property: has part
  some values from: belly
subclass of: Restriction
  on property: has part
  some values from: constricted neck
concept name: <Ding without lid not straight lip serving as tenon not small mouth rectangular mouth without door without swing-handle without spout without single handle with ears vertical ears on the rim straight constricted neck not slanting shoulder not constricted waist rectangular body bulging belly not tri-lobed flat bottom four legs cylindrical legs not slender and spreading legs>
alternative label: Cylindrical-legged Fangding 5
definition: Ding with rectangular mouth,straight vertical ears on the rim,constricted neck,rectangular body,bulging belly,flat bottom and four cylindrical legs
preferred label: 柱足方鼎5 @zh
definition: 鼎带长方形口，竖直立耳在口沿上，束颈，长方体，鼓腹，平底，四柱足 @zh

Cylindrical-legged Rectangular Ding 6
type: Class
subclass of: ding
subclass of: Class
  complement of: Restriction
    on property: has part
    some values from: door
subclass of: Class
  complement of: Restriction
    on property: has part
    some values from: spout
subclass of: Class
  complement of: Restriction
    on property: has part
    some values from: constricted waist
subclass of: Restriction
  on property: has part
  some values from: mouth
subclass of: Restriction
  on property: has belly shape
  some values from: rectangular body
subclass of: Class
  complement of: Restriction
    on property: has part
    some values from: Swing-handle
subclass of: Restriction
  on property: has ear direction
  some values from: Straight
subclass of: Restriction
  on property: has mouth shape
  some values from: rectangular mouth
subclass of: Restriction
  on property: has foot shape
  some values from: cylindrical legs
subclass of: Class
  complement of: Restriction
    on property: has part
    some values from: constricted neck
subclass of: Restriction
  on property: has top shape
  some values from: flat lid
subclass of: Class
  complement of: Restriction
    on property: has bottom
    some values from: Tri-lobedBottom
subclass of: Class
  complement of: Restriction
    on property: has part
    some values from: slanting shoulder
subclass of: Restriction
  on property: has part
  some values from: lid
subclass of: Restriction
  on property: has foot number
  some values from: four foot
subclass of: Class
  complement of: Restriction
    on property: has foot
    some values from: slender and spreading legs
subclass of: Class
  complement of: Restriction
    on property: has mouth
    some values from: StraightLipServingAsTenon
subclass of: Restriction
  on property: has part
  some values from: foot
subclass of: Class
  complement of: Restriction
    on property: has mouth
    some values from: small mouth
subclass of: Restriction
  on property: has part
  some values from: bottom
subclass of: Restriction
  on property: has ear location
  some values from: UnderTheRim
subclass of: Restriction
  on property: has belly wall
  some values from: StraightBelly
subclass of: Restriction
  on property: has bottom shape
  some values from: flat bottom
subclass of: Restriction
  on property: has ear shape
  some values from: side ears
subclass of: Restriction
  on property: has part
  some values from: belly
subclass of: Restriction
  on property: has part
  some values from: ears
subclass of: Class
  complement of: Restriction
    on property: has part
    some values from: single handle
concept name: <Ding with lid flat lid not straight lip serving as tenon not small mouth rectangular mouth without door without swing-handle without spout without single handle with ears side ears under the rim straight not constricted neck not slanting shoulder not constricted waist rectangular body straight belly not tri-lobed flat bottom four legs cylindrical legs not slender and spreading legs>
alternative label: Cylindrical-legged Fangding 6
definition: Ding with flat lid,rectangular mouth,straight side ears under the rim,rectangular body,straight belly,flat bottom and four cylindrical legs
preferred label: 柱足方鼎6 @zh
definition: 鼎带盖，平顶，长方形口，竖直附耳在口沿下，长方体，直腹，平底，四柱足 @zh

cylindrical legs
type: Class
subclass of: foot shape
disjoint with: flat legs
disjoint with: hoof-shaped legs
disjoint with: similar conical legs
disjoint with: similar hoof-shaped legs
disjoint with: Trisquare-shapedLegs
preferred label: 柱足 @zh

ding
type: Class
subclass of: stone
subclass of: Restriction
  on property: hasFunction
  some values from: 用于吃饭
preferred label: 鼎 @zh

direction of ears
type: Class
subclass of: ears
preferred label: 耳的方向 @zh

domed lid
type: Class
subclass of: lid
disjoint with: flat lid
preferred label: 圜顶 @zh

door
type: Class
subclass of: part
preferred label: 门 @zh

ears
type: Class
subclass of: part
preferred label: 耳 @zh

ears with loose rings
type: Class
subclass of: shape of ears
disjoint with: semi-circular ears
disjoint with: side ears
disjoint with: VerticalEars
preferred label: 衔环耳 @zh

Flat-legged Guanding1
type: Class
subclass of: ding
subclass of: Restriction
  on property: has part
  some values from: foot
subclass of: Class
  complement of: Restriction
    on property: has mouth
    some values from: StraightLipServingAsTenon
subclass of: Class
  complement of: Restriction
    on property: has foot
    some values from: slender and spreading legs
subclass of: Class
  complement of: Restriction
    on property: has part
    some values from: single handle
subclass of: Class
  complement of: Restriction
    on property: has part
    some values from: constricted waist
subclass of: Class
  complement of: Restriction
    on property: has part
    some values from: Swing-handle
subclass of: Class
  complement of: Restriction
    on property: has part
    some values from: door
subclass of: Restriction
  on property: has ear shape
  some values from: VerticalEars
subclass of: Restriction
  on property: has part
  some values from: mouth
subclass of: Class
  complement of: Restriction
    on property: has part
    some values from: lid
subclass of: Class
  complement of: Restriction
    on property: has mouth
    some values from: small mouth
subclass of: Class
  complement of: Restriction
    on property: has bottom
    some values from: Tri-lobedBottom
subclass of: Restriction
  on property: has part
  some values from: ears
subclass of: Restriction
  on property: has part
  some values from: constricted neck
subclass of: Class
  complement of: Restriction
    on property: has part
    some values from: spout
subclass of: Restriction
  on property: has belly shape
  some values from: round body
subclass of: Class
  complement of: Restriction
    on property: has part
    some values from: slanting shoulder
subclass of: Restriction
  on property: has foot number
  some values from: ThreeFoot
subclass of: Restriction
  on property: has ear location
  some values from: on the rim
subclass of: Restriction
  on property: has bottom shape
  some values from: bulging bottom
subclass of: Restriction
  on property: has foot shape
  some values from: flat legs
subclass of: Restriction
  on property: has mouth shape
  some values from: circular mouth
subclass of: Restriction
  on property: has part
  some values from: bottom
subclass of: Restriction
  on property: has belly wall
  some values from: bulging belly tapering downwards
subclass of: Restriction
  on property: has ear direction
  some values from: Straight
concept name: <Ding without lid not straight lip serving as tenon not small mouth circular mouth without door without swing-handle without spout without single handle with ears vertical ears on the rim straight constricted neck not slanting shoulder not constricted waist round body bulging belly tapering downwards not tri-lobed bulging bottom three legs flat legs not slender and spreading legs>
definition: Ding with circular mouth,straight vertical ears on the rim,constricted neck,round body,bulging belly tapering downwards,bulging bottom and three flat legs
preferred label: 扁足罐鼎1 @zh
definition: 鼎带圆形口，竖直立耳在口沿上，束颈，圆体，敛腹，圜底，三扁足 @zh

Flat-legged Oblong Ding 1
type: Class
subclass of: ding
subclass of: Class
  complement of: Restriction
    on property: has part
    some values from: door
subclass of: Class
  complement of: Restriction
    on property: has part
    some values from: constricted waist
subclass of: Restriction
  on property: has ear shape
  some values from: VerticalEars
subclass of: Class
  complement of: Restriction
    on property: has bottom
    some values from: Tri-lobedBottom
subclass of: Class
  complement of: Restriction
    on property: has foot
    some values from: slender and spreading legs
subclass of: Class
  complement of: Restriction
    on property: has part
    some values from: spout
subclass of: Restriction
  on property: has mouth shape
  some values from: rectangular mouth
subclass of: Restriction
  on property: has part
  some values from: mouth
subclass of: Restriction
  on property: has ear location
  some values from: on the rim
subclass of: Restriction
  on property: has foot shape
  some values from: flat legs
subclass of: Restriction
  on property: has foot number
  some values from: four foot
subclass of: Restriction
  on property: has belly wall
  some values from: bulging belly
subclass of: Restriction
  on property: has part
  some values from: ears
subclass of: Restriction
  on property: has belly shape
  some values from: oblong body
subclass of: Class
  complement of: Restriction
    on property: has part
    some values from: slanting shoulder
subclass of: Class
  complement of: Restriction
    on property: has mouth
    some values from: small mouth
subclass of: Class
  complement of: Restriction
    on property: has part
    some values from: single handle
subclass of: Class
  complement of: Restriction
    on property: has part
    some values from: lid
subclass of: Restriction
  on property: has part
  some values from: constricted neck
subclass of: Restriction
  on property: has ear direction
  some values from: Straight
subclass of: Class
  complement of: Restriction
    on property: has mouth
    some values from: StraightLipServingAsTenon
subclass of: Class
  complement of: Restriction
    on property: has part
    some values from: Swing-handle
concept name: <Ding without lid not straight lip serving as tenon not small mouth rectangular mouth without door without swing-handle without spout without single handle with ears vertical ears on the rim straight constricted neck not slanting shoulder not constricted waist oblong body bulging belly not tri-lobed slightly bulging bottom four legs flat legs not slender and spreading legs>
definition: Ding with rectangular mouth,straight vertical ears on the rim,constricted neck,oblong body,bulging belly,slightly bulging bottom and four flat legs
preferred label: 扁足椭方鼎1 @zh
definition: 鼎带长方形口，竖直立耳在口沿上，束颈，椭方体，鼓腹，近平底，四扁足 @zh

Flat-legged Pending with Vertical Ears_I
type: Class
subclass of: ding
subclass of: Restriction
  on property: has ear shape
  some values from: VerticalEars
subclass of: Class
  complement of: Restriction
    on property: has mouth
    some values from: small mouth
subclass of: Restriction
  on property: has foot shape
  some values from: flat legs
subclass of: Restriction
  on property: has part
  some values from: mouth
subclass of: Class
  complement of: Restriction
    on property: has part
    some values from: slanting shoulder
subclass of: Restriction
  on property: has part
  some values from: lid
subclass of: Class
  complement of: Restriction
    on property: has part
    some values from: door
subclass of: Restriction
  on property: has part
  some values from: bulging bottom
subclass of: Restriction
  on property: has part
  some values from: foot
subclass of: Restriction
  on property: has top shape
  some values from: flat lid
subclass of: Restriction
  on property: has ear direction
  some values from: Straight
subclass of: Class
  complement of: Restriction
    on property: has part
    some values from: constricted waist
subclass of: Class
  complement of: Restriction
    on property: has part
    some values from: single handle
subclass of: Class
  complement of: Restriction
    on property: has part
    some values from: constricted neck
subclass of: Restriction
  on property: has mouth shape
  some values from: circular mouth
subclass of: Restriction
  on property: has belly wall
  some values from: bulging belly tapering downwards
subclass of: Restriction
  on property: has foot number
  some values from: ThreeFoot
subclass of: Class
  complement of: Restriction
    on property: has foot
    some values from: slender and spreading legs
subclass of: Restriction
  on property: has part
  some values from: ears
subclass of: Restriction
  on property: has belly shape
  some values from: round body
subclass of: Restriction
  on property: has ear location
  some values from: on the rim
subclass of: Class
  complement of: Restriction
    on property: has part
    some values from: spout
subclass of: Class
  complement of: Restriction
    on property: has mouth
    some values from: StraightLipServingAsTenon
subclass of: Class
  complement of: Restriction
    on property: has part
    some values from: Swing-handle
concept name: <Ding with lid flat lid not straight lip serving as tenon not small mouth circular mouth without door without swing-handle without spout without single handle with ears vertical ears on the rim straight not constricted neck not slanting shoulder not constricted waist round body bulging belly tapering downwards not tri-lobed bulging bottom three legs flat legs not slender and spreading legs>
definition: Ding with flat lid,circular mouth,straight vertical ears on the rim,round body,bulging belly tapering downwards,bulging bottom and three flat legs
preferred label: 立耳扁足盆鼎1 @zh
definition: 鼎带盖，平顶，圆形口，竖直立耳在口沿上，圆体，敛腹，圜底，三扁足 @zh

Flat-legged Pending with Vertical Ears 3
type: Class
subclass of: ding
subclass of: Class
  complement of: Restriction
    on property: has part
    some values from: constricted waist
subclass of: Class
  complement of: Restriction
    on property: has mouth
    some values from: small mouth
subclass of: Class
  complement of: Restriction
    on property: has part
    some values from: constricted neck
subclass of: Class
  complement of: Restriction
    on property: has foot
    some values from: slender and spreading legs
subclass of: Restriction
  on property: has foot shape
  some values from: flat legs
subclass of: Class
  complement of: Restriction
    on property: has part
    some values from: slanting shoulder
subclass of: Restriction
  on property: has part
  some values from: bottom
subclass of: Restriction
  on property: has ear location
  some values from: on the rim
subclass of: Restriction
  on property: has belly wall
  some values from: bulging belly tapering downwards
subclass of: Restriction
  on property: has bottom shape
  some values from: bulging bottom
subclass of: Restriction
  on property: has belly shape
  some values from: round body
subclass of: Restriction
  on property: has foot number
  some values from: ThreeFoot
subclass of: Class
  complement of: Restriction
    on property: has part
    some values from: Swing-handle
subclass of: Class
  complement of: Restriction
    on property: has bottom
    some values from: Tri-lobedBottom
subclass of: Restriction
  on property: has ear shape
  some values from: VerticalEars
subclass of: Class
  complement of: Restriction
    on property: has part
    some values from: lid
subclass of: Restriction
  on property: has mouth shape
  some values from: circular mouth
subclass of: Restriction
  on property: has ear direction
  some values from: Straight
subclass of: Restriction
  on property: has part
  some values from: foot
subclass of: Restriction
  on property: has part
  some values from: belly
subclass of: Restriction
  on property: has part
  some values from: ears
subclass of: Class
  complement of: Restriction
    on property: has mouth
    some values from: StraightLipServingAsTenon
subclass of: Class
  complement of: Restriction
    on property: has part
    some values from: single handle
subclass of: Class
  complement of: Restriction
    on property: has part
    some values from: door
subclass of: Class
  complement of: Restriction
    on property: has part
    some values from: spout
subclass of: Restriction
  on property: has part
  some values from: mouth
concept name: <Ding without lid not straight lip serving as tenon not small mouth circular mouth without door without swing-handle without spout without single handle with ears vertical ears on the rim straight not constricted neck not slanting shoulder not constricted waist round body bulging belly tapering downwards not tri-lobed bulging bottom three legs flat legs not slender and spreading legs>
definition: Ding with circular mouth,straight vertical ears on the rim,round body,bulging belly tapering downwards,bulging bottom and three flat legs
preferred label: 立耳扁足盆鼎3 @zh
definition: 鼎带圆形口，竖直立耳在口沿上，圆体，敛腹，圜底，三扁足 @zh

Flat-legged Pending with Vertical Ears 4
type: Class
subclass of: ding
subclass of: Restriction
  on property: has mouth shape
  some values from: circular mouth
subclass of: Class
  complement of: Restriction
    on property: has mouth
    some values from: StraightLipServingAsTenon
subclass of: Class
  complement of: Restriction
    on property: has part
    some values from: slanting shoulder
subclass of: Restriction
  on property: has belly wall
  some values from: bulging belly
subclass of: Restriction
  on property: has ear direction
  some values from: Straight
subclass of: Restriction
  on property: has ear location
  some values from: on the rim
subclass of: Class
  complement of: Restriction
    on property: has foot
    some values from: slender and spreading legs
subclass of: Restriction
  on property: has part
  some values from: foot
subclass of: Class
  complement of: Restriction
    on property: has part
    some values from: constricted waist
subclass of: Restriction
  on property: has ear shape
  some values from: VerticalEars
subclass of: Class
  complement of: Restriction
    on property: has part
    some values from: Swing-handle
subclass of: Class
  complement of: Restriction
    on property: has mouth
    some values from: small mouth
subclass of: Class
  complement of: Restriction
    on property: has bottom
    some values from: Tri-lobedBottom
subclass of: Restriction
  on property: has part
  some values from: ears
subclass of: Class
  complement of: Restriction
    on property: has part
    some values from: spout
subclass of: Restriction
  on property: has part
  some values from: bottom
subclass of: Class
  complement of: Restriction
    on property: has part
    some values from: door
subclass of: Restriction
  on property: has bottom shape
  some values from: bulging bottom
subclass of: Restriction
  on property: has foot number
  some values from: ThreeFoot
subclass of: Class
  complement of: Restriction
    on property: has part
    some values from: lid
subclass of: Class
  complement of: Restriction
    on property: has part
    some values from: constricted neck
subclass of: Class
  complement of: Restriction
    on property: has part
    some values from: single handle
subclass of: Restriction
  on property: has part
  some values from: belly
subclass of: Restriction
  on property: has foot shape
  some values from: flat legs
subclass of: Restriction
  on property: has part
  some values from: mouth
subclass of: Restriction
  on property: has belly shape
  some values from: round body
concept name: <Ding without lid not straight lip serving as tenon not small mouth circular mouth without door without swing-handle without spout without single handle with ears vertical ears on the rim straight not constricted neck not slanting shoulder not constricted waist round body bulging belly not tri-lobed bulging bottom three legs flat legs not slender and spreading legs>
definition: Ding with circular mouth,straight vertical ears on the rim,round body,bulging belly,bulging bottom and three flat legs
preferred label: 立耳扁足盆鼎4 @zh
definition: 鼎带圆形口，竖直立耳在口沿上，圆体，鼓腹，圜底，三扁足 @zh

Flat-legged Pending with Vertical Ears 5
type: Class
subclass of: ding
subclass of: Class
  complement of: Restriction
    on property: has mouth
    some values from: small mouth
subclass of: Restriction
  on property: has part
  some values from: foot
subclass of: Restriction
  on property: has belly shape
  some values from: round body
subclass of: Restriction
  on property: has part
  some values from: bottom
subclass of: Restriction
  on property: has ear direction
  some values from: Straight
subclass of: Restriction
  on property: has part
  some values from: lid
subclass of: Class
  complement of: Restriction
    on property: has part
    some values from: constricted waist
subclass of: Restriction
  on property: has part
  some values from: ears
subclass of: Restriction
  on property: has foot number
  some values from: ThreeFoot
subclass of: Restriction
  on property: has part
  some values from: belly
subclass of: Restriction
  on property: has ear shape
  some values from: VerticalEars
subclass of: Restriction
  on property: has bottom shape
  some values from: bulging bottom
subclass of: Class
  complement of: Restriction
    on property: has foot
    some values from: slender and spreading legs
subclass of: Restriction
  on property: has top shape
  some values from: domed lid
subclass of: Restriction
  on property: has foot shape
  some values from: flat legs
subclass of: Class
  complement of: Restriction
    on property: has part
    some values from: single handle
subclass of: Restriction
  on property: has ear location
  some values from: on the rim
subclass of: Class
  complement of: Restriction
    on property: has mouth
    some values from: StraightLipServingAsTenon
subclass of: Class
  complement of: Restriction
    on property: has part
    some values from: spout
subclass of: Class
  complement of: Restriction
    on property: has part
    some values from: slanting shoulder
subclass of: Restriction
  on property: has belly wall
  some values from: bulging belly tapering downwards
subclass of: Class
  complement of: Restriction
    on property: has part
    some values from: Swing-handle
subclass of: Class
  complement of: Restriction
    on property: has part
    some values from: door
subclass of: Class
  complement of: Restriction
    on property: has part
    some values from: constricted neck
subclass of: Restriction
  on property: has mouth shape
  some values from: circular mouth
subclass of: Class
  complement of: Restriction
    on property: has bottom
    some values from: Tri-lobedBottom
subclass of: Restriction
  on property: has part
  some values from: mouth
concept name: <Ding with lid domed lid not straight lip serving as tenon not small mouth circular mouth without door without swing-handle without spout without single handle with ears vertical ears on the rim straight not constricted neck not slanting shoulder not constricted waist round body bulging belly tapering downwards not tri-lobed bulging bottom three legs flat legs not slender and spreading legs>
definition: Ding with domed lid,circular mouth,straight vertical ears on the rim,round body,bulging belly tapering downwards,bulging bottom and three flat legs
preferred label: 立耳扁足盆鼎5 @zh
definition: 鼎带盖，圜顶，圆形口，竖直立耳在口沿上，圆体，敛腹，圜底，三扁足 @zh

Flat-legged Pending with Vertical Ears 6
type: Class
subclass of: ding
subclass of: Class
  complement of: Restriction
    on property: has part
    some values from: constricted neck
subclass of: Restriction
  on property: has part
  some values from: ears
subclass of: Restriction
  on property: has bottom shape
  some values from: bulging bottom
subclass of: Restriction
  on property: has ear shape
  some values from: VerticalEars
subclass of: Restriction
  on property: has mouth
  some values from: mouth
subclass of: Class
  complement of: Restriction
    on property: has foot
    some values from: slender and spreading legs
subclass of: Restriction
  on property: has foot number
  some values from: ThreeFoot
subclass of: Class
  complement of: Restriction
    on property: has part
    some values from: lid
subclass of: Class
  complement of: Restriction
    on property: has mouth
    some values from: small mouth
subclass of: Restriction
  on property: has ear location
  some values from: on the rim
subclass of: Class
  complement of: Restriction
    on property: has bottom
    some values from: Tri-lobedBottom
subclass of: Restriction
  on property: has part
  some values from: foot
subclass of: Restriction
  on property: has ear direction
  some values from: Straight
subclass of: Class
  complement of: Restriction
    on property: has mouth
    some values from: StraightLipServingAsTenon
subclass of: Class
  complement of: Restriction
    on property: has part
    some values from: Swing-handle
subclass of: Restriction
  on property: has belly wall
  some values from: StraightBelly
subclass of: Class
  complement of: Restriction
    on property: has part
    some values from: spout
subclass of: Class
  complement of: Restriction
    on property: has part
    some values from: single handle
subclass of: Class
  complement of: Restriction
    on property: has part
    some values from: constricted waist
subclass of: Restriction
  on property: has part
  some values from: bottom
subclass of: Restriction
  on property: has foot shape
  some values from: flat legs
subclass of: Restriction
  on property: has part
  some values from: belly
subclass of: Restriction
  on property: has belly shape
  some values from: round body
subclass of: Class
  complement of: Restriction
    on property: has part
    some values from: door
subclass of: Restriction
  on property: has mouth shape
  some values from: circular mouth
subclass of: Class
  complement of: Restriction
    on property: has part
    some values from: slanting shoulder
concept name: <Ding without lid not straight lip serving as tenon not small mouth circular mouth without door without swing-handle without spout without single handle with ears vertical ears on the rim straight not constricted neck not slanting shoulder not constricted waist round body straight belly not tri-lobed bulging bottom three legs flat legs not slender and spreading legs>
definition: Ding with circular mouth,straight vertical ears on the rim,round body,straight belly,bulging bottom and three flat legs
preferred label: 立耳扁足盆鼎6 @zh
definition: 鼎带圆形口，竖直立耳在口沿上，圆体，直腹，圜底，三扁足 @zh

Flat-legged Rectangular Ding 1
type: Class
subclass of: ding
subclass of: Restriction
  on property: has ear direction
  some values from: Straight
subclass of: Class
  complement of: Restriction
    on property: has mouth
    some values from: StraightLipServingAsTenon
subclass of: Class
  complement of: Restriction
    on property: has part
    some values from: slanting shoulder
subclass of: Restriction
  on property: has part
  some values from: ears
subclass of: Class
  complement of: Restriction
    on property: has part
    some values from: constricted neck
subclass of: Class
  complement of: Restriction
    on property: has foot
    some values from: slender and spreading legs
subclass of: Class
  complement of: Restriction
    on property: has part
    some values from: lid
subclass of: Class
  complement of: Restriction
    on property: has part
    some values from: Swing-handle
subclass of: Class
  complement of: Restriction
    on property: has part
    some values from: single handle
subclass of: Restriction
  on property: has ear location
  some values from: on the rim
subclass of: Restriction
  on property: has bottom shape
  some values from: flat bottom
subclass of: Restriction
  on property: has part
  some values from: foot
subclass of: Restriction
  on property: has foot shape
  some values from: flat legs
subclass of: Restriction
  on property: has part
  some values from: bottom
subclass of: Restriction
  on property: has part
  some values from: belly
subclass of: Restriction
  on property: has foot number
  some values from: four foot
subclass of: Class
  complement of: Restriction
    on property: has bottom
    some values from: Tri-lobedBottom
subclass of: Restriction
  on property: has belly shape
  some values from: rectangular body
subclass of: Restriction
  on property: has part
  some values from: mouth
subclass of: Class
  complement of: Restriction
    on property: has part
    some values from: spout
subclass of: Restriction
  on property: has mouth shape
  some values from: rectangular mouth
subclass of: Restriction
  on property: has belly wall
  some values from: bulging belly tapering downwards
subclass of: Class
  complement of: Restriction
    on property: has mouth
    some values from: small mouth
subclass of: Restriction
  on property: has ear shape
  some values from: VerticalEars
subclass of: Class
  complement of: Restriction
    on property: has part
    some values from: door
subclass of: Class
  complement of: Restriction
    on property: has part
    some values from: constricted waist
alternative label: <Ding without lid not straight lip serving as tenon not small mouth rectangular mouth without door without swing-handle without spout without single handle with ears vertical ears on the rim straight not constricted neck not slanting shoulder not constricted waist rectangular body bulging belly tapering downwards not tri-lobed flat bottom four legs flat legs not slender and spreading legs>
definition: Ding with rectangular mouth,straight vertical ears on the rim,rectangular body,bulging belly tapering downwards,flat bottom and four flat legs
alternative label: Flat-legged Fangding 1
preferred label: 扁足方鼎1 @zh
definition: 鼎带长方形口，竖直立耳在口沿上，长方体，敛腹，平底，四扁足 @zh

Flat-legged Rectangular Ding 2
type: Class
subclass of: ding
subclass of: Restriction
  on property: has belly shape
  some values from: rectangular body
subclass of: Restriction
  on property: has part
  some values from: mouth
subclass of: Class
  complement of: Restriction
    on property: has part
    some values from: constricted neck
subclass of: Restriction
  on property: has ear direction
  some values from: Straight
subclass of: Class
  complement of: Restriction
    on property: has foot
    some values from: slender and spreading legs
subclass of: Class
  complement of: Restriction
    on property: has part
    some values from: spout
subclass of: Class
  complement of: Restriction
    on property: has part
    some values from: door
subclass of: Restriction
  on property: has belly wall
  some values from: bulging belly tapering downwards
subclass of: Restriction
  on property: has mouth shape
  some values from: rectangular mouth
subclass of: Class
  complement of: Restriction
    on property: has part
    some values from: Swing-handle
subclass of: Restriction
  on property: has part
  some values from: ears
subclass of: Restriction
  on property: has ear shape
  some values from: VerticalEars
subclass of: Restriction
  on property: has part
  some values from: foot
subclass of: Restriction
  on property: has foot shape
  some values from: flat legs
subclass of: Class
  complement of: Restriction
    on property: has part
    some values from: constricted waist
subclass of: Class
  complement of: Restriction
    on property: has mouth
    some values from: small mouth
subclass of: Class
  complement of: Restriction
    on property: has bottom
    some values from: Tri-lobedBottom
subclass of: Class
  complement of: Restriction
    on property: has part
    some values from: slanting shoulder
subclass of: Class
  complement of: Restriction
    on property: has part
    some values from: single handle
subclass of: Restriction
  on property: has foot number
  some values from: four foot
subclass of: Class
  complement of: Restriction
    on property: has mouth
    some values from: StraightLipServingAsTenon
subclass of: Class
  complement of: Restriction
    on property: has part
    some values from: lid
subclass of: Restriction
  on property: has part
  some values from: bottom
subclass of: Restriction
  on property: has ear location
  some values from: on the rim
subclass of: Restriction
  on property: has part
  some values from: belly
subclass of: Restriction
  on property: has bottom shape
  some values from: bulging bottom
concept name: <Ding without lid not straight lip serving as tenon not small mouth rectangular mouth without door without swing-handle without spout without single handle with ears vertical ears on the rim straight not constricted neck not slanting shoulder not constricted waist rectangular body bulging belly tapering downwards not tri-lobed bulging bottom four legs flat legs not slender and spreading legs>
definition: Ding with rectangular mouth,straight vertical ears on the rim,rectangular body,bulging belly tapering downwards,bulging bottom and four flat legs
alternative label: Flat-legged Fangding 2
preferred label: 扁足方鼎2 @zh
definition: 鼎带长方形口，竖直立耳在口沿上，长方体，敛腹，圜底，四扁足 @zh

Flat-legged Rectangular Ding 3
type: Class
subclass of: ding
subclass of: Restriction
  on property: has part
  some values from: foot
subclass of: Class
  complement of: Restriction
    on property: has bottom
    some values from: Tri-lobedBottom
subclass of: Class
  complement of: Restriction
    on property: has mouth
    some values from: small mouth
subclass of: Class
  complement of: Restriction
    on property: has part
    some values from: lid
subclass of: Restriction
  on property: has part
  some values from: belly
subclass of: Restriction
  on property: has mouth shape
  some values from: rectangular mouth
subclass of: Class
  complement of: Restriction
    on property: has foot
    some values from: slender and spreading legs
subclass of: Restriction
  on property: has ear direction
  some values from: Straight
subclass of: Restriction
  on property: has foot shape
  some values from: flat legs
subclass of: Restriction
  on property: has part
  some values from: bottom
subclass of: Restriction
  on property: has part
  some values from: ears
subclass of: Class
  complement of: Restriction
    on property: has part
    some values from: constricted neck
subclass of: Restriction
  on property: has bottom shape
  some values from: flat bottom
subclass of: Restriction
  on property: has ear shape
  some values from: VerticalEars
subclass of: Class
  complement of: Restriction
    on property: has mouth
    some values from: StraightLipServingAsTenon
subclass of: Class
  complement of: Restriction
    on property: has part
    some values from: single handle
subclass of: Class
  complement of: Restriction
    on property: has part
    some values from: slanting shoulder
subclass of: Class
  complement of: Restriction
    on property: has part
    some values from: spout
subclass of: Class
  complement of: Restriction
    on property: has part
    some values from: Swing-handle
subclass of: Class
  complement of: Restriction
    on property: has part
    some values from: door
subclass of: Class
  complement of: Restriction
    on property: has part
    some values from: constricted waist
subclass of: Restriction
  on property: has belly wall
  some values from: StraightBelly
subclass of: Restriction
  on property: has ear location
  some values from: on the rim
subclass of: Restriction
  on property: has belly shape
  some values from: rectangular body
subclass of: Restriction
  on property: has part
  some values from: mouth
subclass of: Restriction
  on property: has foot number
  some values from: four foot
concept name: <Ding without lid not straight lip serving as tenon not small mouth rectangular mouth without door without swing-handle without spout without single handle with ears vertical ears on the rim straight not constricted neck not slanting shoulder not constricted waist rectangular body straight belly not tri-lobed flat bottom four legs flat legs not slender and spreading legs>
definition: Ding with rectangular mouth,straight vertical ears on the rim,rectangular body,straight belly,flat bottom and four flat legs
preferred label: 扁足方鼎3 @zh
definition: 鼎带长方形口，竖直立耳在口沿上，长方体，直腹，平底，四扁足 @zh

flat bottom
type: Class
subclass of: bottom shape
disjoint with: slightly bulging bottom
preferred label: 平底 @zh

flat legs
type: Class
subclass of: foot shape
disjoint with: hoof-shaped legs
disjoint with: similar conical legs
disjoint with: similar hoof-shaped legs
disjoint with: Trisquare-shapedLegs
preferred label: 扁足 @zh

flat lid
type: Class
subclass of: lid
preferred label: 平顶 @zh

foot
type: Class
subclass of: part
preferred label: 足 @zh

foot number
type: Class
subclass of: foot
preferred label: 足数量 @zh

foot shape
type: Class
subclass of: foot
preferred label: 足形 @zh

four foot
type: Class
subclass of: foot number
disjoint with: ThreeFoot
preferred label: 四足 @zh

Hoof-shaped Leg Guanding 1
type: Class
subclass of: ding
subclass of: Class
  complement of: Restriction
    on property: has part
    some values from: spout
subclass of: Class
  complement of: Restriction
    on property: has foot
    some values from: slender and spreading legs
subclass of: Restriction
  on property: has mouth shape
  some values from: circular mouth
subclass of: Restriction
  on property: has ear shape
  some values from: VerticalEars
subclass of: Restriction
  on property: has belly wall
  some values from: bulging belly
subclass of: Class
  complement of: Restriction
    on property: has part
    some values from: door
subclass of: Restriction
  on property: has belly shape
  some values from: round body
subclass of: Class
  complement of: Restriction
    on property: has part
    some values from: constricted waist
subclass of: Class
  complement of: Restriction
    on property: has part
    some values from: lid
subclass of: Restriction
  on property: has part
  some values from: mouth
subclass of: Restriction
  on property: has part
  some values from: constricted neck
subclass of: Restriction
  on property: has ear direction
  some values from: Spreading
subclass of: Restriction
  on property: has foot number
  some values from: ThreeFoot
subclass of: Restriction
  on property: has part
  some values from: ears
subclass of: Class
  complement of: Restriction
    on property: has part
    some values from: single handle
subclass of: Restriction
  on property: has ear location
  some values from: on the rim
subclass of: Restriction
  on property: has part
  some values from: foot
subclass of: Restriction
  on property: has foot shape
  some values from: hoof-shaped legs
subclass of: Class
  complement of: Restriction
    on property: has mouth
    some values from: small mouth
subclass of: Restriction
  on property: has bottom shape
  some values from: bulging bottom
subclass of: Class
  complement of: Restriction
    on property: has bottom
    some values from: Tri-lobedBottom
subclass of: Class
  complement of: Restriction
    on property: has part
    some values from: slanting shoulder
subclass of: Class
  complement of: Restriction
    on property: has part
    some values from: Swing-handle
subclass of: Class
  complement of: Restriction
    on property: has mouth
    some values from: StraightLipServingAsTenon
subclass of: Restriction
  on property: has part
  some values from: bottom
concept name: <Ding without lid not straight lip serving as tenon not small mouth circular mouth without door without swing-handle without spout without single handle with ears vertical ears on the rim spreading constricted neck not slanting shoulder not constricted waist round body bulging belly not tri-lobed bulging bottom three legs hoof-shaped legs not slender and spreading legs>
definition: Ding with circular mouth,spreading vertical ears on the rim,constricted neck,round body,bulging belly,bulging bottom and three hoof-shaped legs
preferred label: 蹄足罐鼎1 @zh
definition: 鼎带圆形口，外撇立耳在口沿上束颈，圆体，鼓腹，圜底，三蹄足 @zh

Hoof-shaped Leg Guanding 2
type: Class
subclass of: ding
subclass of: Restriction
  on property: has ear shape
  some values from: VerticalEars
subclass of: Restriction
  on property: has part
  some values from: belly
subclass of: Restriction
  on property: has foot number
  some values from: ThreeFoot
subclass of: Class
  complement of: Restriction
    on property: has foot
    some values from: slender and spreading legs
subclass of: Restriction
  on property: has part
  some values from: bottom
subclass of: Restriction
  on property: has belly shape
  some values from: round body
subclass of: Class
  complement of: Restriction
    on property: has mouth
    some values from: small mouth
subclass of: Restriction
  on property: has part
  some values from: mouth
subclass of: Restriction
  on property: has mouth shape
  some values from: circular mouth
subclass of: Class
  complement of: Restriction
    on property: has part
    some values from: constricted waist
subclass of: Class
  complement of: Restriction
    on property: has part
    some values from: single handle
subclass of: Restriction
  on property: has belly wall
  some values from: bulging belly
subclass of: Restriction
  on property: has part
  some values from: foot
subclass of: Class
  complement of: Restriction
    on property: has part
    some values from: spout
subclass of: Class
  complement of: Restriction
    on property: has part
    some values from: slanting shoulder
subclass of: Restriction
  on property: has part
  some values from: constricted neck
subclass of: Class
  complement of: Restriction
    on property: has bottom
    some values from: Tri-lobedBottom
subclass of: Class
  complement of: Restriction
    on property: has part
    some values from: Swing-handle
subclass of: Class
  complement of: Restriction
    on property: has part
    some values from: door
subclass of: Restriction
  on property: has ear direction
  some values from: Spreading
subclass of: Restriction
  on property: has bottom shape
  some values from: slightly bulging bottom
subclass of: Class
  complement of: Restriction
    on property: has mouth
    some values from: StraightLipServingAsTenon
subclass of: Restriction
  on property: has foot shape
  some values from: hoof-shaped legs
subclass of: Restriction
  on property: has ear location
  some values from: on the rim
subclass of: Restriction
  on property: has part
  some values from: ears
concept name: <Ding without lid not straight lip serving as tenon not small mouth circular mouth without door without swing-handle without spout without single handle with ears vertical ears on the rim spreading constricted neck not slanting shoulder not constricted waist round body bulging belly not tri-lobed slightly bulging bottom three legs hoof-shaped legs not slender and spreading legs>
definition: Ding with circular mouth,spreading vertical ears on the rim,constricted neck,round body,bulging belly,slightly bulging bottom and three hoof-shaped legs
preferred label: 蹄足罐鼎2 @zh
definition: 鼎带圆形口，外撇立耳在口沿上，束颈，圆体，鼓腹，近平底，三蹄足 @zh

Hoof-shaped Leg Guanding 3
type: Class
subclass of: ding
subclass of: Restriction
  on property: has part
  some values from: ears
subclass of: Class
  complement of: Restriction
    on property: has part
    some values from: constricted waist
subclass of: Restriction
  on property: has ear direction
  some values from: Straight
subclass of: Restriction
  on property: has part
  some values from: foot
subclass of: Class
  complement of: Restriction
    on property: has mouth
    some values from: small mouth
subclass of: Restriction
  on property: has part
  some values from: bottom
subclass of: Restriction
  on property: has ear shape
  some values from: side ears
subclass of: Class
  complement of: Restriction
    on property: has bottom
    some values from: Tri-lobedBottom
subclass of: Restriction
  on property: has mouth shape
  some values from: circular mouth
subclass of: Class
  complement of: Restriction
    on property: has part
    some values from: lid
subclass of: Class
  complement of: Restriction
    on property: has part
    some values from: single handle
subclass of: Restriction
  on property: has ear location
  some values from: UnderTheRim
subclass of: Restriction
  on property: has part
  some values from: constricted neck
subclass of: Class
  complement of: Restriction
    on property: has mouth
    some values from: StraightLipServingAsTenon
subclass of: Class
  complement of: Restriction
    on property: has part
    some values from: spout
subclass of: Class
  complement of: Restriction
    on property: has part
    some values from: slanting shoulder
subclass of: Restriction
  on property: has belly shape
  some values from: round body
subclass of: Class
  complement of: Restriction
    on property: has part
    some values from: door
subclass of: Restriction
  on property: has part
  some values from: belly
subclass of: Restriction
  on property: has bottom shape
  some values from: bulging bottom
subclass of: Class
  complement of: Restriction
    on property: has part
    some values from: Swing-handle
subclass of: Restriction
  on property: has belly wall
  some values from: bulging belly
subclass of: Class
  complement of: Restriction
    on property: has foot
    some values from: slender and spreading legs
subclass of: Restriction
  on property: has part
  some values from: mouth
subclass of: Restriction
  on property: has foot shape
  some values from: hoof-shaped legs
subclass of: Restriction
  on property: has foot number
  some values from: ThreeFoot
concept name: <Ding without lid not straight lip serving as tenon not small mouth circular mouth without door without swing-handle without spout without single handle with ears side ears under the rim straight constricted neck not slanting shoulder not constricted waist round body bulging belly not tri-lobed bulging bottom three legs hoof-shaped legs not slender and spreading legs>
definition: Ding with circular mouth,straight side ears under the rim,constricted neck,round body,bulging belly,bulging bottom and three hoof-shaped legs
preferred label: 蹄足罐鼎3 @zh
definition: 鼎带圆形口，竖直附耳在口沿下，束颈，圆体，鼓腹，圜底，三蹄足 @zh

Hoof-shaped Leg Guanding 4
type: Class
subclass of: ding
subclass of: Restriction
  on property: has bottom shape
  some values from: bulging bottom
subclass of: Restriction
  on property: has ear location
  some values from: on the shoulder
subclass of: Restriction
  on property: has belly wall
  some values from: bulging belly
subclass of: Restriction
  on property: has part
  some values from: mouth
subclass of: Class
  complement of: Restriction
    on property: has mouth
    some values from: StraightLipServingAsTenon
subclass of: Restriction
  on property: has part
  some values from: belly
subclass of: Restriction
  on property: has belly shape
  some values from: round body
subclass of: Restriction
  on property: has part
  some values from: slanting shoulder
subclass of: Restriction
  on property: has ear direction
  some values from: Straight
subclass of: Class
  complement of: Restriction
    on property: has foot
    some values from: slender and spreading legs
subclass of: Class
  complement of: Restriction
    on property: has part
    some values from: door
subclass of: Class
  complement of: Restriction
    on property: has bottom
    some values from: Tri-lobedBottom
subclass of: Restriction
  on property: has part
  some values from: bottom
subclass of: Class
  complement of: Restriction
    on property: has part
    some values from: single handle
subclass of: Class
  complement of: Restriction
    on property: has part
    some values from: Swing-handle
subclass of: Class
  complement of: Restriction
    on property: has part
    some values from: spout
subclass of: Class
  complement of: Restriction
    on property: has part
    some values from: constricted waist
subclass of: Restriction
  on property: has part
  some values from: ears
subclass of: Restriction
  on property: has foot number
  some values from: ThreeFoot
subclass of: Class
  complement of: Restriction
    on property: has part
    some values from: lid
subclass of: Restriction
  on property: has foot shape
  some values from: hoof-shaped legs
subclass of: Class
  complement of: Restriction
    on property: has mouth
    some values from: small mouth
subclass of: Restriction
  on property: has ear shape
  some values from: side ears
subclass of: Restriction
  on property: has part
  some values from: foot
subclass of: Restriction
  on property: has part
  some values from: constricted neck
subclass of: Restriction
  on property: has mouth shape
  some values from: circular mouth
concept name: <Ding without lid not straight lip serving as tenon not small mouth circular mouth without door without swing-handle without spout without single handle with ears side ears on the shoulder straight constricted neck slanting shoulder not constricted waist round body bulging belly not tri-lobed bulging bottom three legs hoof-shaped legs not slender and spreading legs>
definition: Ding with circular mouth,straight side ears on the shoulder,constricted neck,slanting shoulder,round body,bulging belly,bulging bottom and three hoof-shaped legs
preferred label: 蹄足罐鼎4 @zh
definition: 鼎带圆形口，竖直附耳在肩部，束颈，溜肩，圆体，鼓腹，圜底，三蹄足 @zh

Hoof-shaped Leg Guanding 5
type: Class
subclass of: ding
subclass of: Class
  complement of: Restriction
    on property: has mouth
    some values from: small mouth
subclass of: Restriction
  on property: has belly shape
  some values from: round body
subclass of: Restriction
  on property: has belly wall
  some values from: bulging belly
subclass of: Restriction
  on property: has ear location
  some values from: on the rim
subclass of: Restriction
  on property: has part
  some values from: bottom
subclass of: Class
  complement of: Restriction
    on property: has foot
    some values from: slender and spreading legs
subclass of: Class
  complement of: Restriction
    on property: has part
    some values from: door
subclass of: Restriction
  on property: has bottom shape
  some values from: bulging bottom
subclass of: Class
  complement of: Restriction
    on property: has part
    some values from: single handle
subclass of: Restriction
  on property: has part
  some values from: slanting shoulder
subclass of: Restriction
  on property: has part
  some values from: constricted neck
subclass of: Class
  complement of: Restriction
    on property: has bottom
    some values from: Tri-lobedBottom
subclass of: Class
  complement of: Restriction
    on property: has part
    some values from: spout
subclass of: Restriction
  on property: has ear direction
  some values from: Straight
subclass of: Restriction
  on property: has part
  some values from: foot
subclass of: Class
  complement of: Restriction
    on property: has part
    some values from: constricted waist
subclass of: Restriction
  on property: has ear shape
  some values from: VerticalEars
subclass of: Class
  complement of: Restriction
    on property: has part
    some values from: Swing-handle
subclass of: Class
  complement of: Restriction
    on property: has part
    some values from: lid
subclass of: Restriction
  on property: has mouth shape
  some values from: circular mouth
subclass of: Restriction
  on property: has part
  some values from: mouth
subclass of: Restriction
  on property: has part
  some values from: ears
subclass of: Restriction
  on property: has foot number
  some values from: ThreeFoot
subclass of: Restriction
  on property: has foot shape
  some values from: hoof-shaped legs
subclass of: Restriction
  on property: has part
  some values from: belly
subclass of: Class
  complement of: Restriction
    on property: has mouth
    some values from: StraightLipServingAsTenon
concept name: <Ding without lid not straight lip serving as tenon not small mouth circular mouth without door without swing-handle without spout without single handle with ears vertical ears on the rim straight constricted neck slanting shoulder not constricted waist round body bulging belly not tri-lobed bulging bottom three legs hoof-shaped legs not slender and spreading legs>
definition: Ding with circular mouth,straight vertical ears on the rim,constricted neck,slanting shoulder,round body,bulging belly,bulging bottom and three hoof-shaped legs
preferred label: 蹄足罐鼎5 @zh
definition: 鼎带圆形口，竖直立耳在口沿上，束颈，溜肩，圆体，鼓腹，圜底，三蹄足 @zh

Hoof-shaped Leg Guanding 6
type: Class
subclass of: ding
subclass of: Restriction
  on property: has foot shape
  some values from: hoof-shaped legs
subclass of: Restriction
  on property: has belly wall
  some values from: bulging belly
subclass of: Class
  complement of: Restriction
    on property: has part
    some values from: slanting shoulder
subclass of: Class
  complement of: Restriction
    on property: has bottom
    some values from: Tri-lobedBottom
subclass of: Restriction
  on property: has part
  some values from: belly
subclass of: Restriction
  on property: has foot number
  some values from: ThreeFoot
subclass of: Restriction
  on property: has part
  some values from: mouth
subclass of: Restriction
  on property: has part
  some values from: ears
subclass of: Class
  complement of: Restriction
    on property: has mouth
    some values from: StraightLipServingAsTenon
subclass of: Restriction
  on property: has belly shape
  some values from: round body
subclass of: Restriction
  on property: has top shape
  some values from: flat lid
subclass of: Restriction
  on property: has bottom shape
  some values from: bulging bottom
subclass of: Class
  complement of: Restriction
    on property: has foot
    some values from: slender and spreading legs
subclass of: Class
  complement of: Restriction
    on property: has part
    some values from: single handle
subclass of: Class
  complement of: Restriction
    on property: has part
    some values from: spout
subclass of: Restriction
  on property: has ear shape
  some values from: VerticalEars
subclass of: Restriction
  on property: has ear direction
  some values from: Straight
subclass of: Class
  complement of: Restriction
    on property: has part
    some values from: door
subclass of: Class
  complement of: Restriction
    on property: has part
    some values from: constricted waist
subclass of: Class
  complement of: Restriction
    on property: has part
    some values from: Swing-handle
subclass of: Restriction
  on property: has mouth shape
  some values from: circular mouth
subclass of: Restriction
  on property: has ear location
  some values from: on the rim
subclass of: Class
  complement of: Restriction
    on property: has mouth
    some values from: small mouth
subclass of: Restriction
  on property: has part
  some values from: foot
subclass of: Restriction
  on property: has part
  some values from: bottom
subclass of: Restriction
  on property: has part
  some values from: constricted neck
subclass of: Restriction
  on property: has part
  some values from: lid
concept name: <Ding with lid flat lid not straight lip serving as tenon not small mouth circular mouth without door without swing-handle without spout without single handle with ears vertical ears on the rim straight constricted neck not slanting shoulder not constricted waist round body bulging belly not tri-lobed bulging bottom three legs hoof-shaped legs not slender and spreading legs>
definition: Ding with flat lid,circular mouth,straight vertical ears on the rim,constricted neck,round body,bulging belly,bulging bottom and three hoof-shaped legs
preferred label: 蹄足罐鼎6 @zh
definition: 鼎带盖，平顶，圆形口，竖直立耳在口沿上，束颈，圆体，鼓腹，圜底，三蹄足 @zh

Hoof-shaped Leg Guanding 7
type: Class
subclass of: ding
subclass of: Class
  complement of: Restriction
    on property: has bottom
    some values from: Tri-lobedBottom
subclass of: Class
  complement of: Restriction
    on property: has foot
    some values from: slender and spreading legs
subclass of: Class
  complement of: Restriction
    on property: has part
    some values from: slanting shoulder
subclass of: Restriction
  on property: has part
  some values from: ears
subclass of: Restriction
  on property: has belly wall
  some values from: bulging belly
subclass of: Restriction
  on property: has belly shape
  some values from: round body
subclass of: Restriction
  on property: has foot shape
  some values from: hoof-shaped legs
subclass of: Restriction
  on property: has part
  some values from: mouth
subclass of: Restriction
  on property: has mouth shape
  some values from: circular mouth
subclass of: Class
  complement of: Restriction
    on property: has mouth
    some values from: small mouth
subclass of: Restriction
  on property: has bottom shape
  some values from: bulging bottom
subclass of: Class
  complement of: Restriction
    on property: has part
    some values from: door
subclass of: Restriction
  on property: has ear shape
  some values from: VerticalEars
subclass of: Restriction
  on property: has ear location
  some values from: on the rim
subclass of: Class
  complement of: Restriction
    on property: has part
    some values from: spout
subclass of: Class
  complement of: Restriction
    on property: has part
    some values from: lid
subclass of: Class
  complement of: Restriction
    on property: has part
    some values from: single handle
subclass of: Restriction
  on property: has part
  some values from: constricted neck
subclass of: Restriction
  on property: has part
  some values from: belly
subclass of: Restriction
  on property: has part
  some values from: foot
subclass of: Restriction
  on property: has part
  some values from: bottom
subclass of: Class
  complement of: Restriction
    on property: has part
    some values from: constricted waist
subclass of: Restriction
  on property: has foot number
  some values from: ThreeFoot
subclass of: Restriction
  on property: has ear direction
  some values from: Straight
subclass of: Class
  complement of: Restriction
    on property: has part
    some values from: Swing-handle
subclass of: Class
  complement of: Restriction
    on property: has mouth
    some values from: StraightLipServingAsTenon
concept name: <Ding without lid not straight lip serving as tenon not small mouth circular mouth without door without swing-handle without spout without single handle with ears vertical ears on the rim straight constricted neck not slanting shoulder not constricted waist round body bulging belly not tri-lobed bulging bottom three legs hoof-shaped legs not slender and spreading legs>
definition: Ding with circular mouth,straight vertical ears on the rim,constricted neck,round body,bulging belly,bulging bottom and three hoof-shaped legs
preferred label: 蹄足罐鼎7 @zh
definition: 鼎带圆形口，竖直立耳在口沿上，束颈，圆体，鼓腹，圜底，三蹄足 @zh

Hoof-shaped Leg Guanding 8
type: Class
subclass of: ding
subclass of: Class
  complement of: Restriction
    on property: has part
    some values from: door
subclass of: Class
  complement of: Restriction
    on property: has part
    some values from: Swing-handle
subclass of: Restriction
  on property: has bottom shape
  some values from: slightly bulging bottom
subclass of: Restriction
  on property: has part
  some values from: mouth
subclass of: Restriction
  on property: has part
  some values from: ears
subclass of: Class
  complement of: Restriction
    on property: has part
    some values from: constricted waist
subclass of: Restriction
  on property: has part
  some values from: constricted neck
subclass of: Restriction
  on property: has mouth shape
  some values from: circular mouth
subclass of: Restriction
  on property: has ear location
  some values from: on the rim
subclass of: Class
  complement of: Restriction
    on property: has foot
    some values from: slender and spreading legs
subclass of: Class
  complement of: Restriction
    on property: has part
    some values from: lid
subclass of: Restriction
  on property: has belly shape
  some values from: round body
subclass of: Class
  complement of: Restriction
    on property: has mouth
    some values from: StraightLipServingAsTenon
subclass of: Class
  complement of: Restriction
    on property: has part
    some values from: single handle
subclass of: Restriction
  on property: has part
  some values from: belly
subclass of: Restriction
  on property: has part
  some values from: foot
subclass of: Restriction
  on property: has foot number
  some values from: ThreeFoot
subclass of: Restriction
  on property: has belly wall
  some values from: bulging belly
subclass of: Restriction
  on property: has ear shape
  some values from: VerticalEars
subclass of: Restriction
  on property: has ear direction
  some values from: Straight
subclass of: Class
  complement of: Restriction
    on property: has part
    some values from: spout
subclass of: Restriction
  on property: has part
  some values from: bottom
subclass of: Class
  complement of: Restriction
    on property: has bottom
    some values from: Tri-lobedBottom
subclass of: Class
  complement of: Restriction
    on property: has part
    some values from: slanting shoulder
subclass of: Class
  complement of: Restriction
    on property: has mouth
    some values from: small mouth
subclass of: Restriction
  on property: has foot shape
  some values from: hoof-shaped legs
concept name: <Ding without lid not straight lip serving as tenon not small mouth circular mouth without door without swing-handle without spout without single handle with ears vertical ears on the rim straight constricted neck not slanting shoulder not constricted waist round body bulging belly not tri-lobed slightly bulging bottom three legs hoof-shaped legs not slender and spreading legs>
definition: Ding with circular mouth,straight vertical ears on the rim,constricted neck,round body,bulging belly,slightly bulging bottom and three hoof-shaped legs
preferred label: 蹄足罐鼎8 @zh
definition: 鼎带圆形口，竖直立耳在口沿上，束颈，圆体，鼓腹，近平底，三蹄足 @zh

Hoof-shaped Leg Guanding 9
type: Class
subclass of: ding
subclass of: Restriction
  on property: has foot shape
  some values from: hoof-shaped legs
subclass of: Restriction
  on property: has part
  some values from: ears
subclass of: Restriction
  on property: has belly wall
  some values from: sagging belly
subclass of: Class
  complement of: Restriction
    on property: has bottom
    some values from: Tri-lobedBottom
subclass of: Restriction
  on property: has part
  some values from: mouth
subclass of: Restriction
  on property: has part
  some values from: bottom
subclass of: Class
  complement of: Restriction
    on property: has part
    some values from: slanting shoulder
subclass of: Class
  complement of: Restriction
    on property: has mouth
    some values from: StraightLipServingAsTenon
subclass of: Restriction
  on property: has part
  some values from: foot
subclass of: Restriction
  on property: has ear location
  some values from: on the rim
subclass of: Restriction
  on property: has ear direction
  some values from: Spreading
subclass of: Class
  complement of: Restriction
    on property: has foot
    some values from: slender and spreading legs
subclass of: Restriction
  on property: has part
  some values from: constricted neck
subclass of: Restriction
  on property: has foot number
  some values from: ThreeFoot
subclass of: Class
  complement of: Restriction
    on property: has part
    some values from: lid
subclass of: Class
  complement of: Restriction
    on property: has part
    some values from: door
subclass of: Restriction
  on property: has mouth shape
  some values from: circular mouth
subclass of: Class
  complement of: Restriction
    on property: has part
    some values from: Swing-handle
subclass of: Restriction
  on property: has part
  some values from: belly
subclass of: Restriction
  on property: has ear shape
  some values from: VerticalEars
subclass of: Class
  complement of: Restriction
    on property: has mouth
    some values from: small mouth
subclass of: Class
  complement of: Restriction
    on property: has part
    some values from: single handle
subclass of: Class
  complement of: Restriction
    on property: has part
    some values from: constricted waist
subclass of: Class
  complement of: Restriction
    on property: has part
    some values from: spout
subclass of: Restriction
  on property: has bottom shape
  some values from: bulging bottom
subclass of: Restriction
  on property: has belly shape
  some values from: round body
concept name: <Ding without lid not straight lip serving as tenon not small mouth circular mouth without door without swing-handle without spout without single handle with ears vertical ears on the rim spreading constricted neck not slanting shoulder not constricted waist round body sagging belly not tri-lobed bulging bottom three legs hoof-shaped legs not slender and spreading legs>
definition: Ding with circular mouth,spreading vertical ears on the rim,constricted neck,round body,sagging belly,bulging bottom and three hoof-shaped legs
preferred label: 蹄足罐鼎9 @zh
definition: 鼎带圆形口，外撇立耳在口沿上，束颈，圆体，垂腹，圜底，三蹄足 @zh

Hoof-shaped Leg Oblong Ding 1
type: Class
subclass of: ding
subclass of: Restriction
  on property: has part
  some values from: ears
subclass of: Class
  complement of: Restriction
    on property: has bottom
    some values from: Tri-lobedBottom
subclass of: Restriction
  on property: has ear location
  some values from: UnderTheRim
subclass of: Restriction
  on property: has foot shape
  some values from: hoof-shaped legs
subclass of: Class
  complement of: Restriction
    on property: has part
    some values from: single handle
subclass of: Class
  complement of: Restriction
    on property: has part
    some values from: slanting shoulder
subclass of: Class
  complement of: Restriction
    on property: has mouth
    some values from: small mouth
subclass of: Class
  complement of: Restriction
    on property: has foot
    some values from: slender and spreading legs
subclass of: Restriction
  on property: has foot number
  some values from: four foot
subclass of: Restriction
  on property: has ear direction
  some values from: Straight
subclass of: Restriction
  on property: has ear shape
  some values from: side ears
subclass of: Class
  complement of: Restriction
    on property: has part
    some values from: spout
subclass of: Restriction
  on property: has part
  some values from: foot
subclass of: Restriction
  on property: has part
  some values from: bottom
subclass of: Class
  complement of: Restriction
    on property: has part
    some values from: Swing-handle
subclass of: Class
  complement of: Restriction
    on property: has part
    some values from: constricted neck
subclass of: Class
  complement of: Restriction
    on property: has part
    some values from: lid
subclass of: Restriction
  on property: has belly shape
  some values from: oblong body
subclass of: Class
  complement of: Restriction
    on property: has part
    some values from: door
subclass of: Restriction
  on property: has part
  some values from: belly
subclass of: Restriction
  on property: has part
  some values from: mouth
subclass of: Restriction
  on property: has belly wall
  some values from: StraightBelly
subclass of: Restriction
  on property: has mouth shape
  some values from: oblong mouth
subclass of: Restriction
  on property: has bottom shape
  some values from: flat bottom
subclass of: Class
  complement of: Restriction
    on property: has mouth
    some values from: StraightLipServingAsTenon
subclass of: Class
  complement of: Restriction
    on property: has part
    some values from: constricted waist
concept name: <Ding without lid not straight lip serving as tenon not small mouth oblong mouth without door without swing-handle without spout without single handle with ears side ears under the rim straight not constricted neck not slanting shoulder not constricted waist oblong body straight belly not tri-lobed flat bottom four legs hoof-shaped legs not slender and spreading legs>
definition: Ding with oblong mouth,straight side ears under the rim,oblong body,straight belly,flat bottom and four hoof-shaped legs
preferred label: 蹄足椭方鼎1 @zh
definition: 鼎带椭方形口，竖直附耳在口沿下，椭方体，直腹，平底，四蹄足 @zh

Hoof-shaped Leg Pending with Circular Ears 1
type: Class
subclass of: ding
subclass of: Class
  complement of: Restriction
    on property: has foot
    some values from: slender and spreading legs
subclass of: Class
  complement of: Restriction
    on property: has part
    some values from: door
subclass of: Restriction
  on property: has foot number
  some values from: ThreeFoot
subclass of: Restriction
  on property: has part
  some values from: foot
subclass of: Restriction
  on property: has ear direction
  some values from: Transverse
subclass of: Restriction
  on property: has mouth shape
  some values from: circular mouth
subclass of: Class
  complement of: Restriction
    on property: has part
    some values from: constricted neck
subclass of: Class
  complement of: Restriction
    on property: has bottom
    some values from: Tri-lobedBottom
subclass of: Class
  complement of: Restriction
    on property: has part
    some values from: constricted waist
subclass of: Class
  complement of: Restriction
    on property: has part
    some values from: Swing-handle
subclass of: Class
  complement of: Restriction
    on property: has part
    some values from: slanting shoulder
subclass of: Restriction
  on property: has ear location
  some values from: UnderTheRim
subclass of: Restriction
  on property: has part
  some values from: lid
subclass of: Restriction
  on property: has belly wall
  some values from: bulging belly tapering downwards
subclass of: Class
  complement of: Restriction
    on property: has part
    some values from: single handle
subclass of: Restriction
  on property: has part
  some values from: ears
subclass of: Restriction
  on property: has part
  some values from: bottom
subclass of: Class
  complement of: Restriction
    on property: has part
    some values from: spout
subclass of: Restriction
  on property: has ear shape
  some values from: circular ears
subclass of: Class
  complement of: Restriction
    on property: has mouth
    some values from: small mouth
subclass of: Restriction
  on property: has belly shape
  some values from: round body
subclass of: Restriction
  on property: has foot shape
  some values from: hoof-shaped legs
subclass of: Restriction
  on property: has bottom shape
  some values from: bulging bottom
subclass of: Restriction
  on property: has mouth
  some values from: StraightLipServingAsTenon
preferred label: <Ding with lid straight lip serving as tenon not small mouth circular mouth without door without swing-handle without spout without single handle with ears circular ears under the rim transverse not constricted neck not slanting shoulder not constricted waist round body bulging belly tapering downwards not tri-lobed bulging bottom three legs hoof-shaped legs not slender and spreading legs>
definition: Ding with lid,straight lip serving as tenon,circular mouth,transverse circular ears under the rim,round body,bulging belly tapering downwards,bulging bottom and three hoof-shaped legs
preferred label: 环耳蹄足盆鼎1 @zh
definition: 鼎带盖，子母口，圆形口，横向环耳在口沿下，圆体，敛腹，圜底，三蹄足 @zh

Hoof-shaped Leg Pending with Circular Ears 2
type: Class
subclass of: ding
subclass of: Class
  complement of: Restriction
    on property: has part
    some values from: slanting shoulder
subclass of: Restriction
  on property: has top shape
  some values from: domed lid
subclass of: Restriction
  on property: has belly shape
  some values from: round body
subclass of: Restriction
  on property: has belly wall
  some values from: bulging belly tapering downwards
subclass of: Restriction
  on property: has ear location
  some values from: UnderTheRim
subclass of: Class
  complement of: Restriction
    on property: has part
    some values from: constricted waist
subclass of: Restriction
  on property: has bottom shape
  some values from: bulging bottom
subclass of: Class
  complement of: Restriction
    on property: has mouth
    some values from: small mouth
subclass of: Restriction
  on property: has part
  some values from: foot
subclass of: Restriction
  on property: has part
  some values from: belly
subclass of: Restriction
  on property: has foot number
  some values from: ThreeFoot
subclass of: Class
  complement of: Restriction
    on property: has part
    some values from: spout
subclass of: Class
  complement of: Restriction
    on property: has part
    some values from: constricted neck
subclass of: Restriction
  on property: has part
  some values from: bottom
subclass of: Class
  complement of: Restriction
    on property: has part
    some values from: Swing-handle
subclass of: Restriction
  on property: has part
  some values from: ears
subclass of: Restriction
  on property: has ear direction
  some values from: Transverse
subclass of: Restriction
  on property: has part
  some values from: lid
subclass of: Class
  complement of: Restriction
    on property: has bottom
    some values from: Tri-lobedBottom
subclass of: Restriction
  on property: has mouth
  some values from: StraightLipServingAsTenon
subclass of: Class
  complement of: Restriction
    on property: has foot
    some values from: slender and spreading legs
subclass of: Restriction
  on property: has foot shape
  some values from: hoof-shaped legs
subclass of: Class
  complement of: Restriction
    on property: has part
    some values from: single handle
subclass of: Class
  complement of: Restriction
    on property: has part
    some values from: door
subclass of: Restriction
  on property: has ear shape
  some values from: circular ears
subclass of: Restriction
  on property: has mouth shape
  some values from: circular mouth
concept name: <Ding with lid domed lid straight lip serving as tenon not small mouth circular mouth without door without swing-handle without spout without single handle with ears circular ears under the rim transverse not constricted neck not slanting shoulder not constricted waist round body bulging belly tapering downwards not tri-lobed bulging bottom three legs hoof-shaped legs not slender and spreading legs>
definition: Ding with domed lid,straight lip serving as tenon,circular mouth,transverse circular ears under the rim,round body,bulging belly tapering downwards,bulging bottom and three hoof-shaped legs
preferred label: 环耳蹄足盆鼎2 @zh
definition: 鼎带盖，圜顶，子母口，圆形口，带耳 环耳 耳在口沿下 耳横向 圆体，敛腹，圜底，三蹄足 @zh

Hoof-shaped Leg Pending with Loose Rings 1
type: Class
subclass of: ding
subclass of: Restriction
  on property: has part
  some values from: foot
subclass of: Class
  complement of: Restriction
    on property: has part
    some values from: constricted waist
subclass of: Restriction
  on property: has ear direction
  some values from: Transverse
subclass of: Class
  complement of: Restriction
    on property: has part
    some values from: spout
subclass of: Restriction
  on property: has part
  some values from: ears
subclass of: Class
  complement of: Restriction
    on property: has part
    some values from: Swing-handle
subclass of: Restriction
  on property: has foot shape
  some values from: hoof-shaped legs
subclass of: Restriction
  on property: has part
  some values from: belly
subclass of: Class
  complement of: Restriction
    on property: has mouth
    some values from: small mouth
subclass of: Restriction
  on property: has foot number
  some values from: ThreeFoot
subclass of: Class
  complement of: Restriction
    on property: has part
    some values from: slanting shoulder
subclass of: Class
  complement of: Restriction
    on property: has part
    some values from: door
subclass of: Restriction
  on property: has ear location
  some values from: UnderTheRim
subclass of: Restriction
  on property: has part
  some values from: lid
subclass of: Restriction
  on property: has mouth shape
  some values from: StraightLipServingAsTenon
subclass of: Restriction
  on property: has bottom shape
  some values from: bulging bottom
subclass of: Restriction
  on property: has part
  some values from: bottom
subclass of: Class
  complement of: Restriction
    on property: has foot
    some values from: slender and spreading legs
subclass of: Class
  complement of: Restriction
    on property: has part
    some values from: constricted neck
subclass of: Restriction
  on property: has belly shape
  some values from: round body
subclass of: Class
  complement of: Restriction
    on property: has part
    some values from: single handle
subclass of: Class
  complement of: Restriction
    on property: has bottom
    some values from: Tri-lobedBottom
subclass of: Restriction
  on property: has top shape
  some values from: domed lid
subclass of: Restriction
  on property: has belly wall
  some values from: bulging belly
subclass of: Restriction
  on property: has ear shape
  some values from: ears with loose rings
subclass of: Restriction
  on property: has part
  some values from: mouth
concept name: <Ding with lid domed lid straight lip serving as tenon not small mouth circular mouth without door without swing-handle without spout without single handle with ears ears with loose rings under the rim transverse not constricted neck not slanting shoulder not constricted waist round body bulging belly not tri-lobed bulging bottom three legs hoof-shaped legs not slender and spreading legs>
definition: Ding with domed lid,straight lip serving as tenon,circular mouth,transverse ears with loose rings under the rim,round body,bulging belly,bulging bottom and three hoof-shaped legs
preferred label: 衔环耳蹄足盆鼎1 @zh
definition: 鼎带盖，圜顶，子母口，圆形口，横向衔环耳在口沿下，圆体，鼓腹，圜底，三蹄足 @zh

Hoof-shaped Leg Pending with Side Ears 1
type: Class
subclass of: ding
subclass of: Restriction
  on property: has foot shape
  some values from: hoof-shaped legs
subclass of: Restriction
  on property: has mouth shape
  some values from: circular mouth
subclass of: Restriction
  on property: has part
  some values from: mouth
subclass of: Restriction
  on property: has belly shape
  some values from: round body
subclass of: Class
  complement of: Restriction
    on property: has part
    some values from: constricted waist
subclass of: Class
  complement of: Restriction
    on property: has part
    some values from: door
subclass of: Class
  complement of: Restriction
    on property: has part
    some values from: slanting shoulder
subclass of: Class
  complement of: Restriction
    on property: has mouth
    some values from: StraightLipServingAsTenon
subclass of: Restriction
  on property: has ear direction
  some values from: Straight
subclass of: Class
  complement of: Restriction
    on property: has part
    some values from: single handle
subclass of: Restriction
  on property: has belly wall
  some values from: StraightBelly
subclass of: Restriction
  on property: has part
  some values from: bottom
subclass of: Class
  complement of: Restriction
    on property: has part
    some values from: lid
subclass of: Class
  complement of: Restriction
    on property: has mouth
    some values from: small mouth
subclass of: Class
  complement of: Restriction
    on property: has part
    some values from: constricted neck
subclass of: Restriction
  on property: has bottom shape
  some values from: slightly bulging bottom
subclass of: Restriction
  on property: has foot number
  some values from: ThreeFoot
subclass of: Restriction
  on property: has ear location
  some values from: UnderTheRim
subclass of: Class
  complement of: Restriction
    on property: has part
    some values from: spout
subclass of: Restriction
  on property: has ear shape
  some values from: side ears
subclass of: Restriction
  on property: has part
  some values from: belly
subclass of: Class
  complement of: Restriction
    on property: has part
    some values from: Swing-handle
subclass of: Restriction
  on property: has part
  some values from: ears
subclass of: Restriction
  on property: has part
  some values from: foot
subclass of: Class
  complement of: Restriction
    on property: has foot
    some values from: slender and spreading legs
subclass of: Class
  complement of: Restriction
    on property: has bottom
    some values from: Tri-lobedBottom
preferred label: <Ding without lid not straight lip serving as tenon not small mouth circular mouth without door without swing-handle without spout without single handle with ears side ears under the rim straight not constricted neck not slanting shoulder not constricted waist round body straight belly not tri-lobed slightly bulging bottom three legs hoof-shaped legs not slender and spreading legs>
definition: Ding with circular mouth,straight side ears under the rim,round body,straight belly,slightly bulging bottom and three hoof-shaped legs
preferred label: 附耳蹄足盆鼎1 @zh
definition: 鼎带圆形口，竖直附耳在口沿下，圆体，直腹，近平底，三蹄足 @zh

Hoof-shaped Leg Pending with Side Ears 10
type: Class
subclass of: ding
subclass of: Class
  complement of: Restriction
    on property: has bottom
    some values from: Tri-lobedBottom
subclass of: Class
  complement of: Restriction
    on property: has part
    some values from: spout
subclass of: Restriction
  on property: has bottom shape
  some values from: bulging bottom
subclass of: Restriction
  on property: has part
  some values from: belly
subclass of: Restriction
  on property: has mouth
  some values from: StraightLipServingAsTenon
subclass of: Class
  complement of: Restriction
    on property: has mouth
    some values from: small mouth
subclass of: Restriction
  on property: has part
  some values from: bottom
subclass of: Class
  complement of: Restriction
    on property: has part
    some values from: constricted neck
subclass of: Class
  complement of: Restriction
    on property: has part
    some values from: constricted waist
subclass of: Restriction
  on property: has belly wall
  some values from: bulging belly
subclass of: Class
  complement of: Restriction
    on property: has part
    some values from: slanting shoulder
subclass of: Restriction
  on property: has foot number
  some values from: ThreeFoot
subclass of: Restriction
  on property: has foot shape
  some values from: hoof-shaped legs
subclass of: Restriction
  on property: has ear location
  some values from: UnderTheRim
subclass of: Restriction
  on property: has ear shape
  some values from: side ears
subclass of: Restriction
  on property: has belly shape
  some values from: round body
subclass of: Restriction
  on property: has part
  some values from: ears
subclass of: Class
  complement of: Restriction
    on property: has part
    some values from: single handle
subclass of: Restriction
  on property: has part
  some values from: lid
subclass of: Restriction
  on property: has ear direction
  some values from: Straight
subclass of: Class
  complement of: Restriction
    on property: has part
    some values from: door
subclass of: Class
  complement of: Restriction
    on property: has part
    some values from: Swing-handle
subclass of: Restriction
  on property: has top shape
  some values from: domed lid
subclass of: Restriction
  on property: has mouth shape
  some values from: circular mouth
subclass of: Class
  complement of: Restriction
    on property: has foot
    some values from: slender and spreading legs
subclass of: Restriction
  on property: has part
  some values from: foot
concept name: <Ding with lid domed lid straight lip serving as tenon not small mouth circular mouth without door without swing-handle without spout without single handle with ears side ears under the rim straight not constricted neck not slanting shoulder not constricted waist round body bulging belly not tri-lobed bulging bottom three legs hoof-shaped legs not slender and spreading legs>
definition: Ding with domed lid,straight lip serving as tenon,circular mouth,straight side ears under the rim,round body,bulging belly,bulging bottom and three hoof-shaped legs
preferred label: 附耳蹄足盆鼎10 @zh
definition: 鼎带盖，圜顶，子母口，圆形口，竖直附耳在口沿下，圆体，鼓腹，圜底，三蹄足 @zh

Hoof-shaped Leg Pending with Side Ears 11
type: Class
subclass of: ding
subclass of: Restriction
  on property: has part
  some values from: lid
subclass of: Class
  complement of: Restriction
    on property: has part
    some values from: door
subclass of: Restriction
  on property: has ear direction
  some values from: Straight
subclass of: Class
  complement of: Restriction
    on property: has part
    some values from: single handle
subclass of: Restriction
  on property: has belly wall
  some values from: bulging belly
subclass of: Restriction
  on property: has mouth shape
  some values from: circular mouth
subclass of: Class
  complement of: Restriction
    on property: has part
    some values from: spout
subclass of: Restriction
  on property: has part
  some values from: flat lid
subclass of: Class
  complement of: Restriction
    on property: has foot
    some values from: slender and spreading legs
subclass of: Restriction
  on property: has belly shape
  some values from: round body
subclass of: Restriction
  on property: has part
  some values from: foot
subclass of: Class
  complement of: Restriction
    on property: has bottom
    some values from: Tri-lobedBottom
subclass of: Restriction
  on property: has part
  some values from: ears
subclass of: Class
  complement of: Restriction
    on property: has part
    some values from: Swing-handle
subclass of: Class
  complement of: Restriction
    on property: has part
    some values from: slanting shoulder
subclass of: Class
  complement of: Restriction
    on property: has mouth
    some values from: small mouth
subclass of: Class
  complement of: Restriction
    on property: has part
    some values from: constricted waist
subclass of: Restriction
  on property: has ear shape
  some values from: side ears
subclass of: Class
  complement of: Restriction
    on property: has part
    some values from: constricted neck
subclass of: Restriction
  on property: has ear location
  some values from: UnderTheRim
subclass of: Restriction
  on property: has part
  some values from: belly
subclass of: Restriction
  on property: has bottom shape
  some values from: bulging bottom
subclass of: Restriction
  on property: has foot number
  some values from: ThreeFoot
subclass of: Restriction
  on property: has foot shape
  some values from: hoof-shaped legs
subclass of: Restriction
  on property: has part
  some values from: bottom
subclass of: Restriction
  on property: has mouth
  some values from: StraightLipServingAsTenon
concept name: <Ding with lid flat lid straight lip serving as tenon not small mouth circular mouth without door without swing-handle without spout without single handle with ears side ears under the rim straight not constricted neck not slanting shoulder not constricted waist round body bulging belly not tri-lobed bulging bottom three legs hoof-shaped legs not slender and spreading legs>
definition: Ding with flat lid,straight lip serving as tenon,circular mouth,straight side ears under the rim,round body,bulging belly,bulging bottom and three hoof-shaped legs
preferred label: 附耳蹄足盆鼎11 @zh
definition: 鼎带盖，平顶，子母口，圆形口，竖直附耳在口沿下，圆体，鼓腹，圜底，三蹄足 @zh

Hoof-shaped Leg Pending with Side Ears 12
type: Class
subclass of: ding
subclass of: Restriction
  on property: has mouth shape
  some values from: circular mouth
subclass of: Class
  complement of: Restriction
    on property: has part
    some values from: Swing-handle
subclass of: Restriction
  on property: has ear location
  some values from: UnderTheRim
subclass of: Class
  complement of: Restriction
    on property: has bottom
    some values from: Tri-lobedBottom
subclass of: Restriction
  on property: has part
  some values from: foot
subclass of: Class
  complement of: Restriction
    on property: has part
    some values from: constricted neck
subclass of: Restriction
  on property: has belly wall
  some values from: bulging belly
subclass of: Class
  complement of: Restriction
    on property: has part
    some values from: constricted waist
subclass of: Class
  complement of: Restriction
    on property: has part
    some values from: slanting shoulder
subclass of: Class
  complement of: Restriction
    on property: has part
    some values from: single handle
subclass of: Restriction
  on property: has belly shape
  some values from: round body
subclass of: Restriction
  on property: has ear shape
  some values from: side ears
subclass of: Class
  complement of: Restriction
    on property: has part
    some values from: spout
subclass of: Class
  complement of: Restriction
    on property: has part
    some values from: door
subclass of: Restriction
  on property: has foot shape
  some values from: hoof-shaped legs
subclass of: Restriction
  on property: has bottom shape
  some values from: bulging bottom
subclass of: Restriction
  on property: has foot number
  some values from: ThreeFoot
subclass of: Restriction
  on property: has ear direction
  some values from: Straight
subclass of: Class
  complement of: Restriction
    on property: has mouth
    some values from: small mouth
subclass of: Restriction
  on property: has mouth
  some values from: StraightLipServingAsTenon
subclass of: Restriction
  on property: has part
  some values from: ears
subclass of: Class
  complement of: Restriction
    on property: has foot
    some values from: slender and spreading legs
subclass of: Restriction
  on property: has part
  some values from: lid
subclass of: Restriction
  on property: has part
  some values from: bottom
subclass of: Restriction
  on property: has part
  some values from: belly
concept name: <Ding with lid straight lip serving as tenon not small mouth circular mouth without door without swing-handle without spout without single handle with ears side ears under the rim straight not constricted neck not slanting shoulder not constricted waist round body bulging belly not tri-lobed bulging bottom three legs hoof-shaped legs not slender and spreading legs>
definition: Ding with lid,straight lip serving as tenon,circular mouth,straight side ears under the rim,round body,bulging belly,bulging bottom and three hoof-shaped legs
preferred label: 附耳蹄足盆鼎12 @zh
definition: 鼎带盖，子母口，圆形口，竖直附耳在口沿下，圆体，鼓腹，圜底，三蹄足 @zh

Hoof-shaped Leg Pending with Side Ears 13
type: Class
subclass of: ding
subclass of: Restriction
  on property: has part
  some values from: belly
subclass of: Restriction
  on property: has bottom shape
  some values from: bulging bottom
subclass of: Class
  complement of: Restriction
    on property: has part
    some values from: door
subclass of: Class
  complement of: Restriction
    on property: has part
    some values from: constricted neck
subclass of: Class
  complement of: Restriction
    on property: has part
    some values from: slanting shoulder
subclass of: Restriction
  on property: has foot number
  some values from: ThreeFoot
subclass of: Restriction
  on property: has mouth shape
  some values from: circular mouth
subclass of: Restriction
  on property: has ear direction
  some values from: Straight
subclass of: Restriction
  on property: has part
  some values from: foot
subclass of: Class
  complement of: Restriction
    on property: has part
    some values from: spout
subclass of: Class
  complement of: Restriction
    on property: has part
    some values from: single handle
subclass of: Restriction
  on property: has part
  some values from: ears
subclass of: Class
  complement of: Restriction
    on property: has foot
    some values from: slender and spreading legs
subclass of: Class
  complement of: Restriction
    on property: has mouth
    some values from: small mouth
subclass of: Class
  complement of: Restriction
    on property: has part
    some values from: lid
subclass of: Class
  complement of: Restriction
    on property: has part
    some values from: constricted waist
subclass of: Restriction
  on property: has part
  some values from: mouth
subclass of: Restriction
  on property: has part
  some values from: bottom
subclass of: Class
  complement of: Restriction
    on property: has bottom
    some values from: Tri-lobedBottom
subclass of: Restriction
  on property: has foot shape
  some values from: hoof-shaped legs
subclass of: Restriction
  on property: has ear shape
  some values from: side ears
subclass of: Restriction
  on property: has ear location
  some values from: UnderTheRim
subclass of: Restriction
  on property: has belly shape
  some values from: round body
subclass of: Class
  complement of: Restriction
    on property: has part
    some values from: Swing-handle
subclass of: Class
  complement of: Restriction
    on property: has mouth
    some values from: StraightLipServingAsTenon
subclass of: Restriction
  on property: has belly wall
  some values from: StraightBelly
concept name: <Ding without lid not straight lip serving as tenon not small mouth circular mouth without door without swing-handle without spout without single handle with ears side ears under the rim straight not constricted neck not slanting shoulder not constricted waist round body straight belly not tri-lobed bulging bottom three legs hoof-shaped legs not slender and spreading legs>
definition: Ding with circular mouth,straight side ears under the rim,round body,straight belly,bulging bottom and three hoof-shaped legs
preferred label: 附耳蹄足盆鼎13 @zh
definition: 鼎带圆形口，竖直附耳在口沿下，圆体，直腹，圜底，三蹄足 @zh

Hoof-shaped Leg Pending with Side Ears 14
type: Class
subclass of: ding
subclass of: Restriction
  on property: has bottom shape
  some values from: bulging bottom
subclass of: Restriction
  on property: has mouth shape
  some values from: circular mouth
subclass of: Class
  complement of: Restriction
    on property: has part
    some values from: slanting shoulder
subclass of: Restriction
  on property: has belly shape
  some values from: round body
subclass of: Class
  complement of: Restriction
    on property: has bottom
    some values from: Tri-lobedBottom
subclass of: Class
  complement of: Restriction
    on property: has part
    some values from: spout
subclass of: Class
  complement of: Restriction
    on property: has mouth
    some values from: StraightLipServingAsTenon
subclass of: Class
  complement of: Restriction
    on property: has foot
    some values from: slender and spreading legs
subclass of: Restriction
  on property: has ear direction
  some values from: Straight
subclass of: Class
  complement of: Restriction
    on property: has mouth
    some values from: small mouth
subclass of: Class
  complement of: Restriction
    on property: has part
    some values from: constricted waist
subclass of: Restriction
  on property: has belly wall
  some values from: bulging belly tapering downwards
subclass of: Restriction
  on property: has part
  some values from: foot
subclass of: Restriction
  on property: has part
  some values from: belly
subclass of: Restriction
  on property: has part
  some values from: mouth
subclass of: Class
  complement of: Restriction
    on property: has part
    some values from: constricted neck
subclass of: Restriction
  on property: has foot shape
  some values from: hoof-shaped legs
subclass of: Class
  complement of: Restriction
    on property: has part
    some values from: Swing-handle
subclass of: Class
  complement of: Restriction
    on property: has part
    some values from: door
subclass of: Restriction
  on property: has part
  some values from: ears
subclass of: Restriction
  on property: has ear location
  some values from: UnderTheRim
subclass of: Class
  complement of: Restriction
    on property: has part
    some values from: lid
subclass of: Class
  complement of: Restriction
    on property: has part
    some values from: single handle
subclass of: Restriction
  on property: has part
  some values from: bottom
subclass of: Restriction
  on property: has foot number
  some values from: ThreeFoot
subclass of: Restriction
  on property: has ear shape
  some values from: side ears
concept name: <Ding without lid not straight lip serving as tenon not small mouth circular mouth without door without swing-handle without spout without single handle with ears side ears under the rim straight not constricted neck not slanting shoulder not constricted waist round body bulging belly tapering downwards not tri-lobed bulging bottom three legs hoof-shaped legs not slender and spreading legs>
definition: Ding with circular mouth,straight side ears under the rim,round body,bulging belly tapering downwards,bulging bottom and three hoof-shaped legs
preferred label: 附耳蹄足盆鼎14 @zh
definition: 鼎带圆形口，竖直附耳在口沿下，圆体，敛腹，圜底，三蹄足 @zh

Hoof-shaped Leg Pending with Side Ears 15
type: Class
subclass of: ding
subclass of: Restriction
  on property: has belly wall
  some values from: bulging belly tapering downwards
subclass of: Class
  complement of: Restriction
    on property: has bottom
    some values from: Tri-lobedBottom
subclass of: Restriction
  on property: has ear location
  some values from: UnderTheRim
subclass of: Restriction
  on property: has top shape
  some values from: domed lid
subclass of: Restriction
  on property: has part
  some values from: bottom
subclass of: Restriction
  on property: has mouth
  some values from: StraightLipServingAsTenon
subclass of: Class
  complement of: Restriction
    on property: has mouth
    some values from: small mouth
subclass of: Restriction
  on property: has bottom shape
  some values from: bulging bottom
subclass of: Restriction
  on property: has foot shape
  some values from: hoof-shaped legs
subclass of: Class
  complement of: Restriction
    on property: has part
    some values from: constricted waist
subclass of: Restriction
  on property: has part
  some values from: belly
subclass of: Class
  complement of: Restriction
    on property: has part
    some values from: Swing-handle
subclass of: Restriction
  on property: has part
  some values from: ears
subclass of: Class
  complement of: Restriction
    on property: has part
    some values from: single handle
subclass of: Class
  complement of: Restriction
    on property: has foot
    some values from: slender and spreading legs
subclass of: Class
  complement of: Restriction
    on property: has part
    some values from: spout
subclass of: Class
  complement of: Restriction
    on property: has part
    some values from: slanting shoulder
subclass of: Restriction
  on property: has part
  some values from: foot
subclass of: Restriction
  on property: has foot number
  some values from: ThreeFoot
subclass of: Restriction
  on property: has belly shape
  some values from: round body
subclass of: Restriction
  on property: has ear direction
  some values from: Straight
subclass of: Restriction
  on property: has part
  some values from: lid
subclass of: Restriction
  on property: has ear shape
  some values from: side ears
subclass of: Restriction
  on property: has mouth shape
  some values from: circular mouth
subclass of: Class
  complement of: Restriction
    on property: has part
    some values from: door
subclass of: Class
  complement of: Restriction
    on property: has part
    some values from: constricted neck
concept name: <Ding with lid domed lid straight lip serving as tenon not small mouth circular mouth without door without swing-handle without spout without single handle with ears side ears under the rim straight not constricted neck not slanting shoulder not constricted waist round body bulging belly tapering downwards not tri-lobed bulging bottom three legs hoof-shaped legs not slender and spreading legs>
definition: Ding with domed lid,straight lip serving as tenon,circular mouth,straight side ears under the rim,round body,bulging belly tapering downwards,bulging bottom and three hoof-shaped legs
preferred label: 附耳蹄足盆鼎15 @zh
definition: 鼎带盖，圜顶，子母口，圆形口，竖直附耳在口沿下，圆体，敛腹，圜底，三蹄足 @zh

Hoof-shaped Leg Pending with Side Ears 16
type: Class
subclass of: ding
subclass of: Class
  complement of: Restriction
    on property: has part
    some values from: spout
subclass of: Restriction
  on property: has ear direction
  some values from: Straight
subclass of: Restriction
  on property: has part
  some values from: foot
subclass of: Restriction
  on property: has mouth shape
  some values from: circular mouth
subclass of: Restriction
  on property: has ear location
  some values from: UnderTheRim
subclass of: Restriction
  on property: has part
  some values from: lid
subclass of: Class
  complement of: Restriction
    on property: has foot
    some values from: slender and spreading legs
subclass of: Restriction
  on property: has belly shape
  some values from: round body
subclass of: Restriction
  on property: has part
  some values from: belly
subclass of: Restriction
  on property: has bottom shape
  some values from: bulging bottom
subclass of: Restriction
  on property: has mouth
  some values from: StraightLipServingAsTenon
subclass of: Restriction
  on property: has foot shape
  some values from: hoof-shaped legs
subclass of: Restriction
  on property: has part
  some values from: ears
subclass of: Class
  complement of: Restriction
    on property: has bottom
    some values from: Tri-lobedBottom
subclass of: Class
  complement of: Restriction
    on property: has mouth
    some values from: small mouth
subclass of: Class
  complement of: Restriction
    on property: has part
    some values from: constricted waist
subclass of: Class
  complement of: Restriction
    on property: has part
    some values from: constricted neck
subclass of: Class
  complement of: Restriction
    on property: has part
    some values from: single handle
subclass of: Class
  complement of: Restriction
    on property: has part
    some values from: door
subclass of: Class
  complement of: Restriction
    on property: has part
    some values from: slanting shoulder
subclass of: Restriction
  on property: has foot number
  some values from: ThreeFoot
subclass of: Class
  complement of: Restriction
    on property: has part
    some values from: Swing-handle
subclass of: Restriction
  on property: has ear shape
  some values from: side ears
subclass of: Restriction
  on property: has belly wall
  some values from: bulging belly tapering downwards
subclass of: Restriction
  on property: has part
  some values from: bottom
concept name: <Ding with lid straight lip serving as tenon not small mouth circular mouth without door without swing-handle without spout without single handle with ears side ears under the rim straight not constricted neck not slanting shoulder not constricted waist round body bulging belly tapering downwards not tri-lobed bulging bottom three legs hoof-shaped legs not slender and spreading legs>
definition: Ding with lid,straight lip serving as tenon,circular mouth,straight side ears under the rim,round body,bulging belly tapering downwards,bulging bottom and three hoof-shaped legs
preferred label: 附耳蹄足盆鼎16 @zh
definition: 鼎带盖，子母口，圆形口，竖直附耳在口沿下，圆体，敛腹，圜底，三蹄足 @zh

Hoof-shaped Leg Pending with Side Ears 17
type: Class
subclass of: ding
subclass of: Class
  complement of: Restriction
    on property: has part
    some values from: slanting shoulder
subclass of: Restriction
  on property: has part
  some values from: belly
subclass of: Restriction
  on property: has ear shape
  some values from: side ears
subclass of: Restriction
  on property: has part
  some values from: foot
subclass of: Restriction
  on property: has part
  some values from: ears
subclass of: Restriction
  on property: has belly shape
  some values from: round body
subclass of: Class
  complement of: Restriction
    on property: has part
    some values from: door
subclass of: Restriction
  on property: has foot shape
  some values from: hoof-shaped legs
subclass of: Restriction
  on property: has bottom shape
  some values from: bulging bottom
subclass of: Class
  complement of: Restriction
    on property: has bottom
    some values from: Tri-lobedBottom
subclass of: Restriction
  on property: has ear direction
  some values from: Straight
subclass of: Restriction
  on property: has mouth
  some values from: StraightLipServingAsTenon
subclass of: Restriction
  on property: has top shape
  some values from: flat lid
subclass of: Class
  complement of: Restriction
    on property: has part
    some values from: Swing-handle
subclass of: Class
  complement of: Restriction
    on property: has part
    some values from: constricted waist
subclass of: Restriction
  on property: has part
  some values from: bottom
subclass of: Restriction
  on property: has part
  some values from: lid
subclass of: Restriction
  on property: has belly wall
  some values from: bulging belly tapering downwards
subclass of: Class
  complement of: Restriction
    on property: has mouth
    some values from: small mouth
subclass of: Class
  complement of: Restriction
    on property: has part
    some values from: spout
subclass of: Restriction
  on property: has foot number
  some values from: ThreeFoot
subclass of: Restriction
  on property: has mouth shape
  some values from: circular mouth
subclass of: Restriction
  on property: has ear location
  some values from: UnderTheRim
subclass of: Class
  complement of: Restriction
    on property: has part
    some values from: constricted neck
subclass of: Class
  complement of: Restriction
    on property: has foot
    some values from: slender and spreading legs
subclass of: Class
  complement of: Restriction
    on property: has part
    some values from: single handle
concept name: <Ding with lid flat lid straight lip serving as tenon not small mouth circular mouth without door without swing-handle without spout without single handle with ears side ears under the rim straight not constricted neck not slanting shoulder not constricted waist round body bulging belly tapering downwards not tri-lobed bulging bottom three legs hoof-shaped legs not slender and spreading legs>
definition: Ding with flat lid,straight lip serving as tenon,circular mouth,straight side ears under the rim,round body,bulging belly tapering downwards,bulging bottom and three hoof-shaped legs
preferred label: 附耳蹄足盆鼎17 @zh
definition: 鼎带盖，平顶，子母口，圆形口，竖直附耳在口沿下，圆体，敛腹，圜底，三蹄足 @zh

Hoof-shaped Leg Pending with Side Ears 18
type: Class
subclass of: ding
subclass of: Restriction
  on property: has part
  some values from: belly
subclass of: Class
  complement of: Restriction
    on property: has part
    some values from: constricted waist
subclass of: Restriction
  on property: has foot shape
  some values from: hoof-shaped legs
subclass of: Class
  complement of: Restriction
    on property: has part
    some values from: spout
subclass of: Restriction
  on property: has ear location
  some values from: UnderTheRim
subclass of: Restriction
  on property: has ear shape
  some values from: side ears
subclass of: Class
  complement of: Restriction
    on property: has part
    some values from: constricted neck
subclass of: Restriction
  on property: has belly wall
  some values from: bulging belly tapering downwards
subclass of: Restriction
  on property: has part
  some values from: ears
subclass of: Restriction
  on property: has foot number
  some values from: ThreeFoot
subclass of: Class
  complement of: Restriction
    on property: has foot
    some values from: slender and spreading legs
subclass of: Class
  complement of: Restriction
    on property: has part
    some values from: Swing-handle
subclass of: Restriction
  on property: has mouth shape
  some values from: circular mouth
subclass of: Restriction
  on property: has bottom shape
  some values from: bulging bottom
subclass of: Restriction
  on property: has top shape
  some values from: domed lid
subclass of: Class
  complement of: Restriction
    on property: has mouth
    some values from: small mouth
subclass of: Restriction
  on property: has part
  some values from: foot
subclass of: Restriction
  on property: has ear direction
  some values from: Spreading
subclass of: Class
  complement of: Restriction
    on property: has part
    some values from: single handle
subclass of: Restriction
  on property: has mouth
  some values from: StraightLipServingAsTenon
subclass of: Restriction
  on property: has part
  some values from: lid
subclass of: Class
  complement of: Restriction
    on property: has bottom
    some values from: Tri-lobedBottom
subclass of: Restriction
  on property: has part
  some values from: bottom
subclass of: Class
  complement of: Restriction
    on property: has part
    some values from: slanting shoulder
subclass of: Restriction
  on property: has belly shape
  some values from: round body
subclass of: Class
  complement of: Restriction
    on property: has part
    some values from: door
concept name: <Ding with lid domed lid straight lip serving as tenon not small mouth circular mouth without door without swing-handle without spout without single handle with ears side ears under the rim spreading not constricted neck not slanting shoulder not constricted waist round body bulging belly tapering downwards not tri-lobed bulging bottom three legs hoof-shaped legs not slender and spreading legs>
definition: Ding with domed lid,straight lip serving as tenon,circular mouth,spreading side ears under the rim,round body,bulging belly tapering downwards,bulging bottom and three hoof-shaped legs
preferred label: 附耳蹄足盆鼎18 @zh
definition: 鼎带盖，圜顶，子母口，圆形口，外撇附耳在口沿下，圆体，敛腹，圜底，三蹄足 @zh

Hoof-shaped Leg Pending with Side Ears 19
type: Class
subclass of: ding
subclass of: Class
  complement of: Restriction
    on property: has part
    some values from: single handle
subclass of: Class
  complement of: Restriction
    on property: has part
    some values from: Swing-handle
subclass of: Class
  complement of: Restriction
    on property: has part
    some values from: door
subclass of: Restriction
  on property: has bottom shape
  some values from: bulging bottom
subclass of: Class
  complement of: Restriction
    on property: has part
    some values from: slanting shoulder
subclass of: Restriction
  on property: has top shape
  some values from: flat lid
subclass of: Restriction
  on property: has belly shape
  some values from: round body
subclass of: Class
  complement of: Restriction
    on property: has mouth
    some values from: small mouth
subclass of: Restriction
  on property: has part
  some values from: belly
subclass of: Class
  complement of: Restriction
    on property: has part
    some values from: spout
subclass of: Restriction
  on property: has mouth shape
  some values from: circular mouth
subclass of: Class
  complement of: Restriction
    on property: has bottom
    some values from: Tri-lobedBottom
subclass of: Restriction
  on property: has part
  some values from: bottom
subclass of: Restriction
  on property: has part
  some values from: ears
subclass of: Class
  complement of: Restriction
    on property: has part
    some values from: constricted waist
subclass of: Restriction
  on property: has mouth
  some values from: StraightLipServingAsTenon
subclass of: Class
  complement of: Restriction
    on property: has part
    some values from: constricted neck
subclass of: Restriction
  on property: has ear location
  some values from: UnderTheRim
subclass of: Restriction
  on property: has ear shape
  some values from: side ears
subclass of: Restriction
  on property: has foot shape
  some values from: hoof-shaped legs
subclass of: Restriction
  on property: has belly wall
  some values from: bulging belly
subclass of: Restriction
  on property: has foot number
  some values from: ThreeFoot
subclass of: Restriction
  on property: has part
  some values from: foot
subclass of: Class
  complement of: Restriction
    on property: has foot
    some values from: slender and spreading legs
subclass of: Restriction
  on property: has ear direction
  some values from: Spreading
subclass of: Restriction
  on property: has part
  some values from: lid
concept name: <Ding with lid flat lid straight lip serving as tenon not small mouth circular mouth without door without swing-handle without spout without single handle with ears side ears under the rim spreading not constricted neck not slanting shoulder not constricted waist round body bulging belly not tri-lobed bulging bottom three legs hoof-shaped legs not slender and spreading legs>
definition: Ding with flat lid,straight lip serving as tenon,circular mouth,spreading side ears under the rim,round body,bulging belly,bulging bottom and three hoof-shaped legs
preferred label: 附耳蹄足盆鼎19 @zh
definition: 鼎带盖，平顶，子母口，圆形口，外撇附耳在口沿下圆体，鼓腹，圜底，三蹄足 @zh

Hoof-shaped Leg Pending with Side Ears 2
type: Class
subclass of: ding
subclass of: Class
  complement of: Restriction
    on property: has part
    some values from: spout
subclass of: Restriction
  on property: has part
  some values from: bottom
subclass of: Restriction
  on property: has ear direction
  some values from: Straight
subclass of: Class
  complement of: Restriction
    on property: has foot
    some values from: slender and spreading legs
subclass of: Class
  complement of: Restriction
    on property: has part
    some values from: constricted neck
subclass of: Class
  complement of: Restriction
    on property: has part
    some values from: single handle
subclass of: Class
  complement of: Restriction
    on property: has part
    some values from: slanting shoulder
subclass of: Class
  complement of: Restriction
    on property: has part
    some values from: Swing-handle
subclass of: Restriction
  on property: has top shape
  some values from: domed lid
subclass of: Restriction
  on property: has part
  some values from: foot
subclass of: Restriction
  on property: has belly wall
  some values from: bulging belly
subclass of: Restriction
  on property: has part
  some values from: ears
subclass of: Restriction
  on property: has bottom shape
  some values from: flat bottom
subclass of: Class
  complement of: Restriction
    on property: has bottom
    some values from: Tri-lobedBottom
subclass of: Restriction
  on property: has ear location
  some values from: UnderTheRim
subclass of: Restriction
  on property: has foot shape
  some values from: hoof-shaped legs
subclass of: Class
  complement of: Restriction
    on property: has mouth
    some values from: small mouth
subclass of: Restriction
  on property: has ear shape
  some values from: side ears
subclass of: Class
  complement of: Restriction
    on property: has part
    some values from: door
subclass of: Restriction
  on property: has part
  some values from: belly
subclass of: Restriction
  on property: has mouth shape
  some values from: circular mouth
subclass of: Restriction
  on property: has belly shape
  some values from: round body
subclass of: Restriction
  on property: has part
  some values from: lid
subclass of: Restriction
  on property: has foot number
  some values from: ThreeFoot
subclass of: Class
  complement of: Restriction
    on property: has part
    some values from: constricted waist
subclass of: Restriction
  on property: has mouth
  some values from: StraightLipServingAsTenon
concept name: <Ding with lid domed lid straight lip serving as tenon not small mouth circular mouth without door without swing-handle without spout without single handle with ears side ears under the rim straight not constricted neck not slanting shoulder not constricted waist round body bulging belly not tri-lobed flat bottom three legs hoof-shaped legs not slender and spreading legs>
definition: Ding with domed lid,straight lip serving as tenon,circular mouth,straight side ears under the rim,round body,bulging belly,flat bottom and three hoof-shaped legs
preferred label: 附耳蹄足盆鼎2 @zh
definition: 鼎带盖，圜顶，子母口，圆形口，竖直附耳在口沿下，圆体，鼓腹，平底，三蹄足 @zh

Hoof-shaped Leg Pending with Side Ears 20
type: Class
subclass of: ding
subclass of: Restriction
  on property: has foot shape
  some values from: hoof-shaped legs
subclass of: Restriction
  on property: has belly wall
  some values from: StraightBelly
subclass of: Restriction
  on property: has bottom shape
  some values from: bulging bottom
subclass of: Class
  complement of: Restriction
    on property: has part
    some values from: door
subclass of: Restriction
  on property: has foot number
  some values from: ThreeFoot
subclass of: Restriction
  on property: has mouth shape
  some values from: circular mouth
subclass of: Class
  complement of: Restriction
    on property: has mouth
    some values from: StraightLipServingAsTenon
subclass of: Class
  complement of: Restriction
    on property: has mouth
    some values from: small mouth
subclass of: Restriction
  on property: has part
  some values from: constricted neck
subclass of: Restriction
  on property: has ear direction
  some values from: Straight
subclass of: Class
  complement of: Restriction
    on property: has part
    some values from: Swing-handle
subclass of: Class
  complement of: Restriction
    on property: has part
    some values from: single handle
subclass of: Class
  complement of: Restriction
    on property: has foot
    some values from: slender and spreading legs
subclass of: Restriction
  on property: has ear location
  some values from: UnderTheRim
subclass of: Restriction
  on property: has ear shape
  some values from: side ears
subclass of: Class
  complement of: Restriction
    on property: has part
    some values from: slanting shoulder
subclass of: Restriction
  on property: has part
  some values from: belly
subclass of: Class
  complement of: Restriction
    on property: has bottom
    some values from: Tri-lobedBottom
subclass of: Restriction
  on property: has belly shape
  some values from: round body
subclass of: Restriction
  on property: has part
  some values from: foot
subclass of: Restriction
  on property: has part
  some values from: bottom
subclass of: Class
  complement of: Restriction
    on property: has part
    some values from: spout
subclass of: Class
  complement of: Restriction
    on property: has part
    some values from: lid
subclass of: Restriction
  on property: has part
  some values from: mouth
subclass of: Class
  complement of: Restriction
    on property: has part
    some values from: constricted waist
subclass of: Restriction
  on property: has part
  some values from: ears
concept name: <Ding without lid not straight lip serving as tenon not small mouth circular mouth without door without swing-handle without spout without single handle with ears side ears under the rim straight constricted neck not slanting shoulder not constricted waist round body straight belly not tri-lobed bulging bottom three legs hoof-shaped legs not slender and spreading legs>
definition: Ding with circular mouth,straight side ears under the rim,constricted neck,round body,straight belly,bulging bottom and three hoof-shaped legs
preferred label: 附耳蹄足盆鼎20 @zh
definition: 鼎带圆形口，竖直附耳在口沿下，束颈，圆体，直腹，圜底，三蹄足 @zh

Hoof-shaped Leg Pending with Side Ears 21
type: Class
subclass of: ding
subclass of: Class
  complement of: Restriction
    on property: has part
    some values from: constricted waist
subclass of: Class
  complement of: Restriction
    on property: has foot
    some values from: slender and spreading legs
subclass of: Class
  complement of: Restriction
    on property: has part
    some values from: slanting shoulder
subclass of: Restriction
  on property: has bottom shape
  some values from: bulging bottom
subclass of: Class
  complement of: Restriction
    on property: has mouth
    some values from: StraightLipServingAsTenon
subclass of: Class
  complement of: Restriction
    on property: has mouth
    some values from: small mouth
subclass of: Restriction
  on property: has part
  some values from: bottom
subclass of: Restriction
  on property: has ear direction
  some values from: Straight
subclass of: Restriction
  on property: has mouth shape
  some values from: circular mouth
subclass of: Class
  complement of: Restriction
    on property: has part
    some values from: single handle
subclass of: Class
  complement of: Restriction
    on property: has part
    some values from: Swing-handle
subclass of: Restriction
  on property: has part
  some values from: foot
subclass of: Restriction
  on property: has belly shape
  some values from: round body
subclass of: Class
  complement of: Restriction
    on property: has part
    some values from: constricted neck
subclass of: Restriction
  on property: has ear shape
  some values from: side ears
subclass of: Restriction
  on property: has belly wall
  some values from: bulging belly
subclass of: Restriction
  on property: has part
  some values from: mouth
subclass of: Class
  complement of: Restriction
    on property: has part
    some values from: lid
subclass of: Class
  complement of: Restriction
    on property: has part
    some values from: door
subclass of: Restriction
  on property: has foot number
  some values from: ThreeFoot
subclass of: Restriction
  on property: has part
  some values from: ears
subclass of: Class
  complement of: Restriction
    on property: has part
    some values from: spout
subclass of: Restriction
  on property: has part
  some values from: belly
subclass of: Restriction
  on property: has ear location
  some values from: UnderTheRim
subclass of: Restriction
  on property: has foot shape
  some values from: hoof-shaped legs
subclass of: Class
  complement of: Restriction
    on property: has bottom
    some values from: Tri-lobedBottom
concept name: <Ding without lid not straight lip serving as tenon not small mouth circular mouth without door without swing-handle without spout without single handle with ears side ears under the rim straight not constricted neck not slanting shoulder not constricted waist round body bulging belly not tri-lobed bulging bottom three legs hoof-shaped legs not slender and spreading legs>
definition: Ding with circular mouth,straight side ears under the rim,round body,bulging belly,bulging bottom and three hoof-shaped legs
preferred label: 附耳蹄足盆鼎21 @zh
definition: 鼎带圆形口，竖直附耳在口沿下，圆体，鼓腹，圜底，三蹄足 @zh

Hoof-shaped Leg Pending with Side Ears 22
type: Class
subclass of: ding
subclass of: Restriction
  on property: has part
  some values from: lid
subclass of: Class
  complement of: Restriction
    on property: has part
    some values from: door
subclass of: Restriction
  on property: has part
  some values from: bottom
subclass of: Restriction
  on property: has foot shape
  some values from: hoof-shaped legs
subclass of: Class
  complement of: Restriction
    on property: has part
    some values from: slanting shoulder
subclass of: Restriction
  on property: has belly wall
  some values from: bulging belly tapering downwards
subclass of: Class
  complement of: Restriction
    on property: has foot
    some values from: slender and spreading legs
subclass of: Restriction
  on property: has part
  some values from: foot
subclass of: Restriction
  on property: has ear direction
  some values from: Straight
subclass of: Class
  complement of: Restriction
    on property: has bottom
    some values from: Tri-lobedBottom
subclass of: Restriction
  on property: has part
  some values from: belly
subclass of: Restriction
  on property: has mouth shape
  some values from: circular mouth
subclass of: Restriction
  on property: has top shape
  some values from: domed lid
subclass of: Restriction
  on property: has ear location
  some values from: UnderTheRim
subclass of: Restriction
  on property: has bottom shape
  some values from: bulging bottom
subclass of: Class
  complement of: Restriction
    on property: has part
    some values from: single handle
subclass of: Restriction
  on property: has mouth
  some values from: StraightLipServingAsTenon
subclass of: Restriction
  on property: has foot number
  some values from: ThreeFoot
subclass of: Restriction
  on property: has ear shape
  some values from: side ears
subclass of: Class
  complement of: Restriction
    on property: has part
    some values from: spout
subclass of: Class
  complement of: Restriction
    on property: has part
    some values from: constricted waist
subclass of: Class
  complement of: Restriction
    on property: has mouth
    some values from: small mouth
subclass of: Class
  complement of: Restriction
    on property: has part
    some values from: Swing-handle
subclass of: Restriction
  on property: has part
  some values from: ears
subclass of: Restriction
  on property: has part
  some values from: constricted neck
subclass of: Restriction
  on property: has belly shape
  some values from: round body
concept name: <Ding with lid domed lid straight lip serving as tenon not small mouth circular mouth without door without swing-handle without spout without single handle with ears side ears under the rim straight constricted neck not slanting shoulder not constricted waist round body bulging belly tapering downwards not tri-lobed bulging bottom three legs hoof-shaped legs not slender and spreading legs>
definition: Ding with domed lid,straight lip serving as tenon,circular mouth,straight side ears under the rim,constricted neck,round body,bulging belly tapering downwards,bulging bottom and three hoof-shaped legs
preferred label: 附耳蹄足盆鼎22 @zh
definition: 鼎带盖，圜顶，子母口，圆形口，竖直附耳在口沿下，束颈，圆体，敛腹，圜底，三蹄足 @zh

Hoof-shaped Leg Pending with Side Ears 23
type: Class
subclass of: ding
subclass of: Class
  complement of: Restriction
    on property: has part
    some values from: spout
subclass of: Class
  complement of: Restriction
    on property: has mouth
    some values from: small mouth
subclass of: Restriction
  on property: has part
  some values from: belly
subclass of: Class
  complement of: Restriction
    on property: has part
    some values from: single handle
subclass of: Restriction
  on property: has foot shape
  some values from: hoof-shaped legs
subclass of: Restriction
  on property: has ear direction
  some values from: Straight
subclass of: Restriction
  on property: has bottom shape
  some values from: bulging bottom
subclass of: Restriction
  on property: has part
  some values from: foot
subclass of: Class
  complement of: Restriction
    on property: has part
    some values from: slanting shoulder
subclass of: Restriction
  on property: has belly wall
  some values from: bulging belly
subclass of: Restriction
  on property: has foot number
  some values from: ThreeFoot
subclass of: Class
  complement of: Restriction
    on property: has part
    some values from: lid
subclass of: Class
  complement of: Restriction
    on property: has part
    some values from: constricted waist
subclass of: Restriction
  on property: has belly shape
  some values from: round body
subclass of: Restriction
  on property: has ear location
  some values from: on the rim
subclass of: Restriction
  on property: has part
  some values from: ears
subclass of: Restriction
  on property: has part
  some values from: bottom
subclass of: Class
  complement of: Restriction
    on property: has mouth
    some values from: StraightLipServingAsTenon
subclass of: Class
  complement of: Restriction
    on property: has part
    some values from: constricted neck
subclass of: Class
  complement of: Restriction
    on property: has bottom
    some values from: Tri-lobedBottom
subclass of: Class
  complement of: Restriction
    on property: has part
    some values from: Swing-handle
subclass of: Restriction
  on property: has ear shape
  some values from: side ears
subclass of: Class
  complement of: Restriction
    on property: has part
    some values from: door
subclass of: Restriction
  on property: has mouth shape
  some values from: circular mouth
subclass of: Class
  complement of: Restriction
    on property: has foot
    some values from: slender and spreading legs
subclass of: Restriction
  on property: has part
  some values from: mouth
concept name: <Ding without lid not straight lip serving as tenon not small mouth circular mouth without door without swing-handle without spout without single handle with ears side ears on the rim straight not constricted neck not slanting shoulder not constricted waist round body bulging belly not tri-lobed bulging bottom three legs hoof-shaped legs not slender and spreading legs>
definition: Ding with circular mouth,straight side ears on the rim,round body,bulging belly,bulging bottom and three hoof-shaped legs
preferred label: 附耳蹄足盆鼎23 @zh
definition: 鼎带圆形口，竖直附耳在口沿上，圆体，鼓腹，圜底，三蹄足 @zh

Hoof-shaped Leg Pending with Side Ears 24
type: Class
subclass of: ding
subclass of: Restriction
  on property: has part
  some values from: belly
subclass of: Restriction
  on property: has belly wall
  some values from: bulging belly tapering downwards
subclass of: Restriction
  on property: has belly shape
  some values from: round body
subclass of: Restriction
  on property: has mouth shape
  some values from: circular mouth
subclass of: Restriction
  on property: has part
  some values from: bottom
subclass of: Restriction
  on property: has foot shape
  some values from: hoof-shaped legs
subclass of: Class
  complement of: Restriction
    on property: has part
    some values from: constricted waist
subclass of: Class
  complement of: Restriction
    on property: has part
    some values from: spout
subclass of: Class
  complement of: Restriction
    on property: has part
    some values from: lid
subclass of: Restriction
  on property: has foot number
  some values from: ThreeFoot
subclass of: Restriction
  on property: has ear location
  some values from: UnderTheRim
subclass of: Restriction
  on property: has part
  some values from: foot
subclass of: Class
  complement of: Restriction
    on property: has part
    some values from: door
subclass of: Restriction
  on property: has part
  some values from: constricted neck
subclass of: Class
  complement of: Restriction
    on property: has part
    some values from: single handle
subclass of: Restriction
  on property: has ear direction
  some values from: Straight
subclass of: Class
  complement of: Restriction
    on property: has mouth
    some values from: small mouth
subclass of: Restriction
  on property: has part
  some values from: mouth
subclass of: Class
  complement of: Restriction
    on property: has foot
    some values from: slender and spreading legs
subclass of: Restriction
  on property: has bottom shape
  some values from: bulging bottom
subclass of: Restriction
  on property: has part
  some values from: ears
subclass of: Class
  complement of: Restriction
    on property: has part
    some values from: Swing-handle
subclass of: Class
  complement of: Restriction
    on property: has mouth
    some values from: StraightLipServingAsTenon
subclass of: Class
  complement of: Restriction
    on property: has bottom
    some values from: Tri-lobedBottom
subclass of: Class
  complement of: Restriction
    on property: has part
    some values from: slanting shoulder
subclass of: Restriction
  on property: has ear shape
  some values from: side ears
concept name: <Ding without lid not straight lip serving as tenon not small mouth circular mouth without door without swing-handle without spout without single handle with ears side ears under the rim straight constricted neck not slanting shoulder not constricted waist round body bulging belly tapering downwards not tri-lobed bulging bottom three legs hoof-shaped legs not slender and spreading legs>
definition: Ding with circular mouth,straight side ears under the rim,constricted neck,round body,bulging belly tapering downwards,bulging bottom and three hoof-shaped legs
preferred label: 附耳蹄足盆鼎24 @zh
definition: 鼎带圆形口，竖直附耳在口沿下，束颈，圆体，敛腹，圜底，三蹄足 @zh

Hoof-shaped Leg Pending with Side Ears 25
type: Class
subclass of: ding
subclass of: Class
  complement of: Restriction
    on property: has part
    some values from: Swing-handle
subclass of: Class
  complement of: Restriction
    on property: has mouth
    some values from: small mouth
subclass of: Restriction
  on property: has foot shape
  some values from: hoof-shaped legs
subclass of: Restriction
  on property: has part
  some values from: foot
subclass of: Class
  complement of: Restriction
    on property: has part
    some values from: slanting shoulder
subclass of: Restriction
  on property: has ear direction
  some values from: Straight
subclass of: Restriction
  on property: has ear shape
  some values from: side ears
subclass of: Restriction
  on property: has part
  some values from: belly
subclass of: Class
  complement of: Restriction
    on property: has foot
    some values from: slender and spreading legs
subclass of: Restriction
  on property: has belly shape
  some values from: round body
subclass of: Restriction
  on property: has part
  some values from: lid
subclass of: Restriction
  on property: has top shape
  some values from: flat lid
subclass of: Restriction
  on property: has part
  some values from: ears
subclass of: Restriction
  on property: has ear location
  some values from: UnderTheRim
subclass of: Restriction
  on property: has bottom shape
  some values from: slightly bulging bottom
subclass of: Restriction
  on property: has belly wall
  some values from: StraightBelly
subclass of: Class
  complement of: Restriction
    on property: has part
    some values from: door
subclass of: Class
  complement of: Restriction
    on property: has part
    some values from: spout
subclass of: Class
  complement of: Restriction
    on property: has part
    some values from: constricted neck
subclass of: Restriction
  on property: has mouth
  some values from: StraightLipServingAsTenon
subclass of: Restriction
  on property: has part
  some values from: bottom
subclass of: Class
  complement of: Restriction
    on property: has bottom
    some values from: Tri-lobedBottom
subclass of: Class
  complement of: Restriction
    on property: has part
    some values from: constricted waist
subclass of: Restriction
  on property: has mouth shape
  some values from: circular mouth
subclass of: Restriction
  on property: has foot number
  some values from: ThreeFoot
subclass of: Class
  complement of: Restriction
    on property: has part
    some values from: single handle
concept name: <Ding with lid flat lid straight lip serving as tenon not small mouth circular mouth without door without swing-handle without spout without single handle with ears side ears under the rim straight not constricted neck not slanting shoulder not constricted waist round body straight belly not tri-lobed slightly bulging bottom three legs hoof-shaped legs not slender and spreading legs>
definition: Ding with flat lid,straight lip serving as tenon,circular mouth,straight side ears under the rim,round body,straight belly,slightly bulging bottom and three hoof-shaped legs
preferred label: 附耳蹄足盆鼎25 @zh
definition: 鼎带盖，平顶，子母口，圆形口，竖直附耳在口沿下，圆体，直腹，近平底，三蹄足 @zh

Hoof-shaped Leg Pending with Side Ears 26
type: Class
subclass of: ding
subclass of: Class
  complement of: Restriction
    on property: has part
    some values from: Swing-handle
subclass of: Class
  complement of: Restriction
    on property: has part
    some values from: spout
subclass of: Restriction
  on property: has mouth
  some values from: StraightLipServingAsTenon
subclass of: Restriction
  on property: has mouth shape
  some values from: circular mouth
subclass of: Restriction
  on property: has belly wall
  some values from: StraightBelly
subclass of: Class
  complement of: Restriction
    on property: has bottom
    some values from: Tri-lobedBottom
subclass of: Restriction
  on property: has top shape
  some values from: domed lid
subclass of: Restriction
  on property: has part
  some values from: foot
subclass of: Restriction
  on property: has bottom shape
  some values from: bulging bottom
subclass of: Class
  complement of: Restriction
    on property: has part
    some values from: door
subclass of: Class
  complement of: Restriction
    on property: has part
    some values from: constricted neck
subclass of: Restriction
  on property: has ear location
  some values from: UnderTheRim
subclass of: Class
  complement of: Restriction
    on property: has part
    some values from: slanting shoulder
subclass of: Restriction
  on property: has ear shape
  some values from: side ears
subclass of: Class
  complement of: Restriction
    on property: has mouth
    some values from: small mouth
subclass of: Restriction
  on property: has part
  some values from: lid
subclass of: Class
  complement of: Restriction
    on property: has foot
    some values from: slender and spreading legs
subclass of: Restriction
  on property: has belly shape
  some values from: round body
subclass of: Restriction
  on property: has part
  some values from: ears
subclass of: Restriction
  on property: has foot number
  some values from: ThreeFoot
subclass of: Restriction
  on property: has ear direction
  some values from: Straight
subclass of: Restriction
  on property: has foot shape
  some values from: hoof-shaped legs
subclass of: Class
  complement of: Restriction
    on property: has part
    some values from: single handle
subclass of: Restriction
  on property: has part
  some values from: belly
subclass of: Class
  complement of: Restriction
    on property: has part
    some values from: constricted waist
subclass of: Restriction
  on property: has part
  some values from: bottom
concept name: <Ding with lid domed lid straight lip serving as tenon not small mouth circular mouth without door without swing-handle without spout without single handle with ears side ears under the rim straight not constricted neck not slanting shoulder not constricted waist round body straight belly not tri-lobed bulging bottom three legs hoof-shaped legs not slender and spreading legs>
definition: Ding with domed lid,straight lip serving as tenon,circular mouth,straight side ears under the rim,round body,straight belly,bulging bottom and three hoof-shaped legs
preferred label: 附耳蹄足盆鼎26 @zh
definition: 鼎带盖，圜顶，子母口，圆形口，竖直附耳在口沿下，圆体，直腹，圜底，三蹄足 @zh

Hoof-shaped Leg Pending with Side Ears 3
type: Class
subclass of: ding
subclass of: Class
  complement of: Restriction
    on property: has part
    some values from: single handle
subclass of: Class
  complement of: Restriction
    on property: has part
    some values from: constricted waist
subclass of: Restriction
  on property: has belly shape
  some values from: round body
subclass of: Restriction
  on property: has foot number
  some values from: ThreeFoot
subclass of: Restriction
  on property: has part
  some values from: ears
subclass of: Class
  complement of: Restriction
    on property: has part
    some values from: Swing-handle
subclass of: Restriction
  on property: has part
  some values from: belly
subclass of: Restriction
  on property: has ear shape
  some values from: side ears
subclass of: Class
  complement of: Restriction
    on property: has part
    some values from: slanting shoulder
subclass of: Restriction
  on property: has mouth shape
  some values from: circular mouth
subclass of: Class
  complement of: Restriction
    on property: has part
    some values from: lid
subclass of: Class
  complement of: Restriction
    on property: has part
    some values from: spout
subclass of: Class
  complement of: Restriction
    on property: has mouth
    some values from: small mouth
subclass of: Class
  complement of: Restriction
    on property: has part
    some values from: door
subclass of: Restriction
  on property: has part
  some values from: constricted neck
subclass of: Restriction
  on property: has ear location
  some values from: UnderTheRim
subclass of: Restriction
  on property: has part
  some values from: mouth
subclass of: Restriction
  on property: has bottom shape
  some values from: flat bottom
subclass of: Class
  complement of: Restriction
    on property: has bottom
    some values from: Tri-lobedBottom
subclass of: Restriction
  on property: has part
  some values from: bottom
subclass of: Restriction
  on property: has part
  some values from: foot
subclass of: Class
  complement of: Restriction
    on property: has mouth
    some values from: StraightLipServingAsTenon
subclass of: Restriction
  on property: has foot shape
  some values from: hoof-shaped legs
subclass of: Restriction
  on property: has ear direction
  some values from: Straight
subclass of: Restriction
  on property: has belly wall
  some values from: bulging belly
subclass of: Class
  complement of: Restriction
    on property: has foot
    some values from: slender and spreading legs
concept name: <Ding without lid not straight lip serving as tenon not small mouth circular mouth without door without swing-handle without spout without single handle with ears side ears under the rim straight constricted neck not slanting shoulder not constricted waist round body bulging belly not tri-lobed flat bottom three legs hoof-shaped legs not slender and spreading legs >
definition: Ding with circular mouth,straight side ears under the rim,constricted neck,round body,bulging belly,flat bottom and three hoof-shaped legs
preferred label: 附耳蹄足盆鼎3 @zh
definition: 鼎带圆形口，竖直附耳在口沿下，束颈，圆体，鼓腹，平底，三蹄足 @zh

Hoof-shaped Leg Pending with Side Ears 4
type: Class
subclass of: ding
subclass of: Restriction
  on property: has ear shape
  some values from: side ears
subclass of: Class
  complement of: Restriction
    on property: has part
    some values from: door
subclass of: Restriction
  on property: has top shape
  some values from: domed lid
subclass of: Restriction
  on property: has part
  some values from: bottom
subclass of: Restriction
  on property: has part
  some values from: foot
subclass of: Restriction
  on property: has bottom shape
  some values from: bulging bottom
subclass of: Restriction
  on property: has belly wall
  some values from: sagging belly
subclass of: Restriction
  on property: has ear direction
  some values from: Straight
subclass of: Class
  complement of: Restriction
    on property: has foot
    some values from: slender and spreading legs
subclass of: Restriction
  on property: has foot shape
  some values from: hoof-shaped legs
subclass of: Restriction
  on property: has foot number
  some values from: ThreeFoot
subclass of: Restriction
  on property: has part
  some values from: ears
subclass of: Class
  complement of: Restriction
    on property: has mouth
    some values from: small mouth
subclass of: Restriction
  on property: has part
  some values from: belly
subclass of: Restriction
  on property: has mouth
  some values from: StraightLipServingAsTenon
subclass of: Class
  complement of: Restriction
    on property: has part
    some values from: slanting shoulder
subclass of: Class
  complement of: Restriction
    on property: has part
    some values from: constricted neck
subclass of: Class
  complement of: Restriction
    on property: has part
    some values from: spout
subclass of: Restriction
  on property: has part
  some values from: lid
subclass of: Class
  complement of: Restriction
    on property: has part
    some values from: constricted waist
subclass of: Restriction
  on property: has ear location
  some values from: UnderTheRim
subclass of: Restriction
  on property: has mouth shape
  some values from: circular mouth
subclass of: Class
  complement of: Restriction
    on property: has part
    some values from: Swing-handle
subclass of: Restriction
  on property: has belly shape
  some values from: round body
subclass of: Class
  complement of: Restriction
    on property: has part
    some values from: single handle
subclass of: Class
  complement of: Restriction
    on property: has bottom
    some values from: Tri-lobedBottom
concept name: <Ding with lid domed lid straight lip serving as tenon not small mouth circular mouth without door without swing-handle without spout without single handle with ears side ears under the rim straight not constricted neck not slanting shoulder not constricted waist round body sagging belly not tri-lobed bulging bottom three legs hoof-shaped legs not slender and spreading legs>
definition: Ding with domed lid,straight lip serving as tenon,circular mouth,straight side ears under the rim,round body,sagging belly,bulging bottom and three hoof-shaped legs
preferred label: 附耳蹄足盆鼎4 @zh
definition: 鼎带盖，圜顶，子母口，圆形口，竖直附耳在口沿下，圆体，垂腹，圜底，三蹄足 @zh

Hoof-shaped Leg Pending with Side Ears 5
type: Class
subclass of: ding
subclass of: Class
  complement of: Restriction
    on property: has mouth
    some values from: StraightLipServingAsTenon
subclass of: Class
  complement of: Restriction
    on property: has mouth
    some values from: small mouth
subclass of: Class
  complement of: Restriction
    on property: has part
    some values from: constricted neck
subclass of: Restriction
  on property: has part
  some values from: belly
subclass of: Restriction
  on property: has part
  some values from: mouth
subclass of: Restriction
  on property: has belly shape
  some values from: round body
subclass of: Class
  complement of: Restriction
    on property: has foot
    some values from: slender and spreading legs
subclass of: Restriction
  on property: has belly wall
  some values from: sagging belly
subclass of: Restriction
  on property: has part
  some values from: foot
subclass of: Class
  complement of: Restriction
    on property: has bottom
    some values from: Tri-lobedBottom
subclass of: Restriction
  on property: has mouth shape
  some values from: circular mouth
subclass of: Class
  complement of: Restriction
    on property: has part
    some values from: slanting shoulder
subclass of: Restriction
  on property: has foot shape
  some values from: hoof-shaped legs
subclass of: Restriction
  on property: has ear location
  some values from: UnderTheRim
subclass of: Class
  complement of: Restriction
    on property: has part
    some values from: Swing-handle
subclass of: Class
  complement of: Restriction
    on property: has part
    some values from: single handle
subclass of: Class
  complement of: Restriction
    on property: has part
    some values from: door
subclass of: Class
  complement of: Restriction
    on property: has part
    some values from: spout
subclass of: Class
  complement of: Restriction
    on property: has part
    some values from: constricted waist
subclass of: Restriction
  on property: has ear shape
  some values from: side ears
subclass of: Restriction
  on property: has part
  some values from: bottom
subclass of: Restriction
  on property: has bottom shape
  some values from: bulging bottom
subclass of: Restriction
  on property: has ear direction
  some values from: Straight
subclass of: Restriction
  on property: has part
  some values from: ears
subclass of: Restriction
  on property: has foot number
  some values from: ThreeFoot
subclass of: Class
  complement of: Restriction
    on property: has part
    some values from: lid
concept name: <Ding without lid not straight lip serving as tenon not small mouth circular mouth without door without swing-handle without spout without single handle with ears side ears under the rim straight not constricted neck not slanting shoulder not constricted waist round body sagging belly not tri-lobed bulging bottom three legs hoof-shaped legs not slender and spreading legs>
definition: Ding with circular mouth,straight side ears under the rim,round body,sagging belly,bulging bottom and three hoof-shaped legs
preferred label: 附耳蹄足盆鼎5 @zh
definition: 鼎带圆形口，竖直附耳在口沿下，圆体，垂腹，圜底，三蹄足 @zh

Hoof-shaped Leg Pending with Side Ears 6
type: Class
subclass of: ding
subclass of: Class
  complement of: Restriction
    on property: has mouth
    some values from: small mouth
subclass of: Restriction
  on property: has part
  some values from: belly
subclass of: Class
  complement of: Restriction
    on property: has part
    some values from: single handle
subclass of: Class
  complement of: Restriction
    on property: has part
    some values from: door
subclass of: Restriction
  on property: has part
  some values from: bottom
subclass of: Class
  complement of: Restriction
    on property: has mouth
    some values from: StraightLipServingAsTenon
subclass of: Class
  complement of: Restriction
    on property: has foot
    some values from: slender and spreading legs
subclass of: Restriction
  on property: has belly wall
  some values from: bulging belly tapering downwards
subclass of: Class
  complement of: Restriction
    on property: has part
    some values from: constricted neck
subclass of: Restriction
  on property: has mouth shape
  some values from: circular mouth
subclass of: Restriction
  on property: has part
  some values from: ears
subclass of: Class
  complement of: Restriction
    on property: has part
    some values from: spout
subclass of: Class
  complement of: Restriction
    on property: has part
    some values from: constricted waist
subclass of: Restriction
  on property: has ear location
  some values from: UnderTheRim
subclass of: Class
  complement of: Restriction
    on property: has bottom
    some values from: Tri-lobedBottom
subclass of: Restriction
  on property: has part
  some values from: mouth
subclass of: Restriction
  on property: has bottom shape
  some values from: bulging bottom
subclass of: Restriction
  on property: has foot shape
  some values from: hoof-shaped legs
subclass of: Class
  complement of: Restriction
    on property: has part
    some values from: Swing-handle
subclass of: Restriction
  on property: has belly shape
  some values from: round body
subclass of: Restriction
  on property: has ear shape
  some values from: side ears
subclass of: Class
  complement of: Restriction
    on property: has part
    some values from: slanting shoulder
subclass of: Restriction
  on property: has part
  some values from: lid
subclass of: Restriction
  on property: has part
  some values from: foot
subclass of: Restriction
  on property: has top shape
  some values from: flat lid
subclass of: Restriction
  on property: has ear direction
  some values from: Straight
subclass of: Restriction
  on property: has foot number
  some values from: ThreeFoot
concept name: <Ding with lid flat lid not straight lip serving as tenon not small mouth circular mouth without door without swing-handle without spout without single handle with ears side ears under the rim straight not constricted neck not slanting shoulder not constricted waist round body bulging belly tapering downwards not tri-lobed bulging bottom three legs hoof-shaped legs not slender and spreading legs>
definition: Ding with flat lid,circular mouth,straight side ears under the rim,round body,bulging belly tapering downwards,bulging bottom and three hoof-shaped legs
preferred label: 附耳蹄足盆鼎6 @zh
definition: 鼎带盖，平顶，圆形口，竖直附耳在口沿下，圆体，敛腹，圜底，三蹄足 @zh

Hoof-shaped Leg Pending with Side Ears 7
type: Class
subclass of: ding
subclass of: Class
  complement of: Restriction
    on property: has foot
    some values from: slender and spreading legs
subclass of: Restriction
  on property: has part
  some values from: ears
subclass of: Class
  complement of: Restriction
    on property: has mouth
    some values from: StraightLipServingAsTenon
subclass of: Restriction
  on property: has ear direction
  some values from: Straight
subclass of: Class
  complement of: Restriction
    on property: has mouth
    some values from: small mouth
subclass of: Restriction
  on property: has part
  some values from: belly
subclass of: Restriction
  on property: has belly shape
  some values from: round body
subclass of: Class
  complement of: Restriction
    on property: has bottom
    some values from: Tri-lobedBottom
subclass of: Restriction
  on property: has foot shape
  some values from: hoof-shaped legs
subclass of: Class
  complement of: Restriction
    on property: has part
    some values from: single handle
subclass of: Restriction
  on property: has part
  some values from: foot
subclass of: Class
  complement of: Restriction
    on property: has part
    some values from: lid
subclass of: Restriction
  on property: has mouth shape
  some values from: circular mouth
subclass of: Class
  complement of: Restriction
    on property: has part
    some values from: spout
subclass of: Restriction
  on property: has bottom shape
  some values from: slightly bulging bottom
subclass of: Restriction
  on property: has foot number
  some values from: ThreeFoot
subclass of: Restriction
  on property: has belly wall
  some values from: StraightBelly
subclass of: Restriction
  on property: has part
  some values from: constricted neck
subclass of: Class
  complement of: Restriction
    on property: has part
    some values from: slanting shoulder
subclass of: Restriction
  on property: has ear shape
  some values from: side ears
subclass of: Restriction
  on property: has part
  some values from: bottom
subclass of: Class
  complement of: Restriction
    on property: has part
    some values from: door
subclass of: Class
  complement of: Restriction
    on property: has part
    some values from: Swing-handle
subclass of: Class
  complement of: Restriction
    on property: has part
    some values from: constricted waist
subclass of: Restriction
  on property: has ear location
  some values from: UnderTheRim
subclass of: Restriction
  on property: has part
  some values from: mouth
concept name: <Ding without lid not straight lip serving as tenon not small mouth circular mouth without door without swing-handle without spout without single handle with ears side ears under the rim straight constricted neck not slanting shoulder not constricted waist round body straight belly not tri-lobed slightly bulging bottom three legs hoof-shaped legs not slender and spreading legs>
definition: Ding with circular mouth,straight side ears under the rim,constricted neck,round body,straight belly,slightly bulging bottom and three hoof-shaped legs
preferred label: 附耳蹄足盆鼎7 @zh
definition: 鼎带圆形口，竖直附耳在口沿下，束颈，圆体，直腹，近平底，三蹄足 @zh

Hoof-shaped Leg Pending with Side Ears 8
type: Class
subclass of: ding
subclass of: Class
  complement of: Restriction
    on property: has part
    some values from: spout
subclass of: Restriction
  on property: has part
  some values from: foot
subclass of: Class
  complement of: Restriction
    on property: has foot
    some values from: slender and spreading legs
subclass of: Restriction
  on property: has part
  some values from: bottom
subclass of: Class
  complement of: Restriction
    on property: has mouth
    some values from: small mouth
subclass of: Restriction
  on property: has foot number
  some values from: ThreeFoot
subclass of: Restriction
  on property: has part
  some values from: ears
subclass of: Class
  complement of: Restriction
    on property: has part
    some values from: door
subclass of: Restriction
  on property: has belly shape
  some values from: round body
subclass of: Class
  complement of: Restriction
    on property: has mouth
    some values from: StraightLipServingAsTenon
subclass of: Class
  complement of: Restriction
    on property: has part
    some values from: Swing-handle
subclass of: Restriction
  on property: has mouth shape
  some values from: circular mouth
subclass of: Restriction
  on property: has part
  some values from: mouth
subclass of: Restriction
  on property: has part
  some values from: constricted neck
subclass of: Restriction
  on property: has foot shape
  some values from: similar hoof-shaped legs
subclass of: Restriction
  on property: has bottom shape
  some values from: slightly bulging bottom
subclass of: Class
  complement of: Restriction
    on property: has part
    some values from: slanting shoulder
subclass of: Restriction
  on property: has ear direction
  some values from: Straight
subclass of: Restriction
  on property: has part
  some values from: belly
subclass of: Restriction
  on property: has ear location
  some values from: on the rim
subclass of: Class
  complement of: Restriction
    on property: has part
    some values from: constricted waist
subclass of: Class
  complement of: Restriction
    on property: has bottom
    some values from: Tri-lobedBottom
subclass of: Restriction
  on property: has belly wall
  some values from: sagging belly
subclass of: Class
  complement of: Restriction
    on property: has part
    some values from: single handle
subclass of: Class
  complement of: Restriction
    on property: has part
    some values from: lid
subclass of: Restriction
  on property: has ear shape
  some values from: VerticalEars
concept name: <Ding with lid straight lip serving as tenon not small mouth circular mouth without door without swing-handle without spout without single handle with ears side ears under the rim straight not constricted neck not slanting shoulder not constricted waist round body straight belly not tri-lobed bulging bottom three legs hoof-shaped legs not slender and spreading legs>
definition: Ding with lid,straight lip serving as tenon,circular mouth,straight side ears under the rim,round body,straight belly,bulging bottom and three hoof-shaped legs
preferred label: 附耳蹄足盆鼎8 @zh
definition: 鼎带圆形口，竖直立耳在口沿上，束颈，圆体，垂腹，近平底，三近蹄足 @zh

Hoof-shaped Leg Pending with Side Ears 9
type: Class
subclass of: ding
subclass of: Class
  complement of: Restriction
    on property: has part
    some values from: constricted waist
subclass of: Restriction
  on property: has ear shape
  some values from: side ears
subclass of: Restriction
  on property: has mouth
  some values from: StraightLipServingAsTenon
subclass of: Class
  complement of: Restriction
    on property: has part
    some values from: constricted neck
subclass of: Restriction
  on property: has top shape
  some values from: flat lid
subclass of: Restriction
  on property: has part
  some values from: lid
subclass of: Restriction
  on property: has mouth shape
  some values from: circular mouth
subclass of: Restriction
  on property: has foot number
  some values from: ThreeFoot
subclass of: Restriction
  on property: has part
  some values from: belly
subclass of: Restriction
  on property: has belly wall
  some values from: sagging belly
subclass of: Restriction
  on property: has foot shape
  some values from: hoof-shaped legs
subclass of: Class
  complement of: Restriction
    on property: has foot
    some values from: slender and spreading legs
subclass of: Restriction
  on property: has bottom shape
  some values from: bulging bottom
subclass of: Restriction
  on property: has ear direction
  some values from: Straight
subclass of: Restriction
  on property: has ear location
  some values from: UnderTheRim
subclass of: Restriction
  on property: has part
  some values from: ears
subclass of: Class
  complement of: Restriction
    on property: has part
    some values from: Swing-handle
subclass of: Class
  complement of: Restriction
    on property: has bottom
    some values from: Tri-lobedBottom
subclass of: Restriction
  on property: has part
  some values from: bottom
subclass of: Class
  complement of: Restriction
    on property: has part
    some values from: single handle
subclass of: Restriction
  on property: has belly shape
  some values from: round body
subclass of: Class
  complement of: Restriction
    on property: has part
    some values from: spout
subclass of: Class
  complement of: Restriction
    on property: has part
    some values from: slanting shoulder
subclass of: Class
  complement of: Restriction
    on property: has mouth
    some values from: small mouth
subclass of: Class
  complement of: Restriction
    on property: has part
    some values from: door
subclass of: Restriction
  on property: has part
  some values from: foot
concept name: <Ding with lid flat lid straight lip serving as tenon not small mouth circular mouth without door without swing-handle without spout without single handle with ears side ears under the rim straight not constricted neck not slanting shoulder not constricted waist round body sagging belly not tri-lobed bulging bottom three legs hoof-shaped legs not slender and spreading legs>
definition: Ding with flat lid,straight lip serving as tenon,circular mouth,straight side ears under the rim,round body,sagging belly,bulging bottom and three hoof-shaped legs
preferred label: 附耳蹄足盆鼎9 @zh
definition: 鼎带盖，平顶，子母口，圆形口，竖直附耳在口沿下，圆体，垂腹，圜底，三蹄足 @zh

Hoof-shaped Leg Pending with Vertical Ears 1
type: Class
subclass of: ding
subclass of: Class
  complement of: Restriction
    on property: has mouth
    some values from: StraightLipServingAsTenon
subclass of: Restriction
  on property: has belly wall
  some values from: sagging belly
subclass of: Class
  complement of: Restriction
    on property: has foot
    some values from: slender and spreading legs
subclass of: Restriction
  on property: has mouth shape
  some values from: circular mouth
subclass of: Restriction
  on property: has part
  some values from: foot
subclass of: Restriction
  on property: has bottom shape
  some values from: slightly bulging bottom
subclass of: Restriction
  on property: has belly shape
  some values from: round body
subclass of: Class
  complement of: Restriction
    on property: has part
    some values from: Swing-handle
subclass of: Class
  complement of: Restriction
    on property: has part
    some values from: slanting shoulder
subclass of: Restriction
  on property: has foot number
  some values from: ThreeFoot
subclass of: Class
  complement of: Restriction
    on property: has part
    some values from: door
subclass of: Restriction
  on property: has part
  some values from: belly
subclass of: Class
  complement of: Restriction
    on property: has part
    some values from: constricted waist
subclass of: Class
  complement of: Restriction
    on property: has bottom
    some values from: Tri-lobedBottom
subclass of: Class
  complement of: Restriction
    on property: has part
    some values from: single handle
subclass of: Restriction
  on property: has ear location
  some values from: on the rim
subclass of: Class
  complement of: Restriction
    on property: has mouth
    some values from: small mouth
subclass of: Restriction
  on property: has foot shape
  some values from: hoof-shaped legs
subclass of: Restriction
  on property: has part
  some values from: mouth
subclass of: Class
  complement of: Restriction
    on property: has part
    some values from: constricted neck
subclass of: Class
  complement of: Restriction
    on property: has part
    some values from: lid
subclass of: Restriction
  on property: has ear direction
  some values from: Spreading
subclass of: Restriction
  on property: has ear shape
  some values from: VerticalEars
subclass of: Restriction
  on property: has part
  some values from: ears
subclass of: Class
  complement of: Restriction
    on property: has part
    some values from: spout
subclass of: Restriction
  on property: has part
  some values from: bottom
concept name: <Ding without lid not straight lip serving as tenon not small mouth circular mouth without door without swing-handle without spout without single handle with ears vertical ears on the rim spreading not constricted neck not slanting shoulder not constricted waist round body sagging belly not tri-lobed slightly bulging bottom three legs hoof-shaped legs not slender and spreading legs>
definition: Ding with circular mouth,spreading vertical ears on the rim,round body,sagging belly,slightly bulging bottom and three hoof-shaped legs
preferred label: 立耳蹄足盆鼎1 @zh
definition: 鼎带圆形口，外撇立耳在口沿上，圆体，垂腹，近平底，三蹄足 @zh

Hoof-shaped Leg Pending with Vertical Ears 10
type: Class
subclass of: ding
subclass of: Class
  complement of: Restriction
    on property: has foot
    some values from: slender and spreading legs
subclass of: Class
  complement of: Restriction
    on property: has part
    some values from: single handle
subclass of: Class
  complement of: Restriction
    on property: has part
    some values from: constricted neck
subclass of: Restriction
  on property: has ear location
  some values from: on the rim
subclass of: Restriction
  on property: has part
  some values from: lid
subclass of: Restriction
  on property: has bottom shape
  some values from: bulging bottom
subclass of: Class
  complement of: Restriction
    on property: has part
    some values from: slanting shoulder
subclass of: Restriction
  on property: has foot shape
  some values from: hoof-shaped legs
subclass of: Class
  complement of: Restriction
    on property: has part
    some values from: constricted waist
subclass of: Restriction
  on property: has part
  some values from: foot
subclass of: Restriction
  on property: has belly wall
  some values from: bulging belly tapering downwards
subclass of: Restriction
  on property: has ear direction
  some values from: Spreading
subclass of: Restriction
  on property: has part
  some values from: ears
subclass of: Class
  complement of: Restriction
    on property: has bottom
    some values from: Tri-lobedBottom
subclass of: Class
  complement of: Restriction
    on property: has part
    some values from: spout
subclass of: Class
  complement of: Restriction
    on property: has part
    some values from: Swing-handle
subclass of: Class
  complement of: Restriction
    on property: has mouth
    some values from: small mouth
subclass of: Restriction
  on property: has belly shape
  some values from: round body
subclass of: Restriction
  on property: has foot number
  some values from: ThreeFoot
subclass of: Class
  complement of: Restriction
    on property: has part
    some values from: door
subclass of: Restriction
  on property: has ear shape
  some values from: VerticalEars
subclass of: Restriction
  on property: has mouth
  some values from: circular mouth
subclass of: Restriction
  on property: has top shape
  some values from: flat lid
subclass of: Restriction
  on property: has part
  some values from: belly
subclass of: Class
  complement of: Restriction
    on property: has mouth
    some values from: StraightLipServingAsTenon
subclass of: Restriction
  on property: has part
  some values from: bottom
concept name: <Ding with lid flat lid not straight lip serving as tenon not small mouth circular mouth without door without swing-handle without spout without single handle with ears vertical ears on the rim spreading not constricted neck not slanting shoulder not constricted waist round body bulging belly tapering downwards not tri-lobed bulging bottom three legs hoof-shaped legs not slender and spreading legs>
definition: Ding with flat lid,circular mouth,spreading vertical ears on the rim,round body,bulging belly tapering downwards,bulging bottom and three hoof-shaped legs
preferred label: 立耳蹄足盆鼎10 @zh
definition: 鼎带盖，平顶，圆形口，外撇立耳在口沿上，圆体，敛腹，圜底，三蹄足 @zh

Hoof-shaped Leg Pending with Vertical Ears 11
type: Class
subclass of: ding
subclass of: Restriction
  on property: has belly wall
  some values from: bulging belly tapering downwards
subclass of: Class
  complement of: Restriction
    on property: has part
    some values from: single handle
subclass of: Restriction
  on property: has part
  some values from: constricted neck
subclass of: Restriction
  on property: has part
  some values from: belly
subclass of: Restriction
  on property: has foot number
  some values from: ThreeFoot
subclass of: Restriction
  on property: has belly shape
  some values from: round body
subclass of: Restriction
  on property: has ear location
  some values from: on the rim
subclass of: Restriction
  on property: has part
  some values from: mouth
subclass of: Restriction
  on property: has part
  some values from: ears
subclass of: Class
  complement of: Restriction
    on property: has part
    some values from: lid
subclass of: Restriction
  on property: has mouth shape
  some values from: circular mouth
subclass of: Class
  complement of: Restriction
    on property: has bottom
    some values from: Tri-lobedBottom
subclass of: Restriction
  on property: has part
  some values from: bottom
subclass of: Restriction
  on property: has ear shape
  some values from: VerticalEars
subclass of: Restriction
  on property: has bottom shape
  some values from: bulging bottom
subclass of: Class
  complement of: Restriction
    on property: has part
    some values from: door
subclass of: Class
  complement of: Restriction
    on property: has part
    some values from: constricted waist
subclass of: Restriction
  on property: has ear direction
  some values from: Straight
subclass of: Class
  complement of: Restriction
    on property: has part
    some values from: spout
subclass of: Class
  complement of: Restriction
    on property: has mouth
    some values from: small mouth
subclass of: Class
  complement of: Restriction
    on property: has mouth
    some values from: StraightLipServingAsTenon
subclass of: Restriction
  on property: has foot shape
  some values from: hoof-shaped legs
subclass of: Restriction
  on property: has part
  some values from: foot
subclass of: Class
  complement of: Restriction
    on property: has foot
    some values from: slender and spreading legs
subclass of: Class
  complement of: Restriction
    on property: has part
    some values from: slanting shoulder
subclass of: Class
  complement of: Restriction
    on property: has part
    some values from: Swing-handle
concept name: <Ding without lid not straight lip serving as tenon not small mouth circular mouth without door without swing-handle without spout without single handle with ears vertical ears on the rim straight constricted neck not slanting shoulder not constricted waist round body bulging belly tapering downwards not tri-lobed bulging bottom three legs hoof-shaped legs not slender and spreading legs>
definition: Ding with circular mouth,straight vertical ears on the rim,constricted neck,round body,bulging belly tapering downwards,bulging bottom and three hoof-shaped legs
preferred label: 立耳蹄足盆鼎11 @zh
definition: 鼎带圆形口，竖直立耳在口沿上，束颈，圆体，敛腹，圜底，三蹄足 @zh

Hoof-shaped Leg Pending with Vertical Ears 12
type: Class
subclass of: ding
subclass of: Class
  complement of: Restriction
    on property: has bottom
    some values from: Tri-lobedBottom
subclass of: Restriction
  on property: has belly wall
  some values from: sagging belly
subclass of: Restriction
  on property: has part
  some values from: ears
subclass of: Restriction
  on property: has mouth shape
  some values from: circular mouth
subclass of: Restriction
  on property: has foot number
  some values from: ThreeFoot
subclass of: Restriction
  on property: has part
  some values from: foot
subclass of: Restriction
  on property: has part
  some values from: bottom
subclass of: Class
  complement of: Restriction
    on property: has part
    some values from: lid
subclass of: Restriction
  on property: has part
  some values from: belly
subclass of: Restriction
  on property: has foot shape
  some values from: hoof-shaped legs
subclass of: Restriction
  on property: has belly shape
  some values from: round body
subclass of: Restriction
  on property: has part
  some values from: mouth
subclass of: Restriction
  on property: has ear location
  some values from: on the rim
subclass of: Class
  complement of: Restriction
    on property: has mouth
    some values from: small mouth
subclass of: Restriction
  on property: has ear direction
  some values from: Straight
subclass of: Class
  complement of: Restriction
    on property: has part
    some values from: constricted neck
subclass of: Restriction
  on property: has bottom shape
  some values from: bulging bottom
subclass of: Class
  complement of: Restriction
    on property: has foot
    some values from: slender and spreading legs
subclass of: Class
  complement of: Restriction
    on property: has part
    some values from: Swing-handle
subclass of: Class
  complement of: Restriction
    on property: has part
    some values from: single handle
subclass of: Class
  complement of: Restriction
    on property: has part
    some values from: door
subclass of: Class
  complement of: Restriction
    on property: has mouth
    some values from: StraightLipServingAsTenon
subclass of: Restriction
  on property: has ear shape
  some values from: VerticalEars
subclass of: Class
  complement of: Restriction
    on property: has part
    some values from: slanting shoulder
subclass of: Class
  complement of: Restriction
    on property: has part
    some values from: constricted waist
subclass of: Class
  complement of: Restriction
    on property: has part
    some values from: spout
concept name: <Ding without lid not straight lip serving as tenon not small mouth circular mouth without door without swing-handle without spout without single handle with ears vertical ears on the rim straight not constricted neck not slanting shoulder not constricted waist round body sagging belly not tri-lobed bulging bottom three legs hoof-shaped legs not slender and spreading legs>
definition: Ding with circular mouth,straight vertical ears on the rim,round body,sagging belly,bulging bottom and three hoof-shaped legs
preferred label: 立耳蹄足盆鼎12 @zh
definition: 鼎带圆形口，竖直立耳在口沿上，圆体，垂腹，圜底，三蹄足 @zh

Hoof-shaped Leg Pending with Vertical Ears 13
type: Class
subclass of: ding
subclass of: Class
  complement of: Restriction
    on property: has part
    some values from: single handle
subclass of: Restriction
  on property: has belly wall
  some values from: bulging belly
subclass of: Class
  complement of: Restriction
    on property: has part
    some values from: constricted neck
subclass of: Restriction
  on property: has belly shape
  some values from: round body
subclass of: Restriction
  on property: has part
  some values from: ears
subclass of: Restriction
  on property: has ear shape
  some values from: VerticalEars
subclass of: Restriction
  on property: has foot shape
  some values from: hoof-shaped legs
subclass of: Restriction
  on property: has mouth shape
  some values from: circular mouth
subclass of: Restriction
  on property: has part
  some values from: bottom
subclass of: Restriction
  on property: has part
  some values from: belly
subclass of: Restriction
  on property: has part
  some values from: mouth
subclass of: Restriction
  on property: has foot number
  some values from: ThreeFoot
subclass of: Class
  complement of: Restriction
    on property: has part
    some values from: door
subclass of: Restriction
  on property: has ear direction
  some values from: Straight
subclass of: Class
  complement of: Restriction
    on property: has part
    some values from: lid
subclass of: Class
  complement of: Restriction
    on property: has part
    some values from: Swing-handle
subclass of: Class
  complement of: Restriction
    on property: has part
    some values from: constricted waist
subclass of: Restriction
  on property: has bottom shape
  some values from: bulging bottom
subclass of: Class
  complement of: Restriction
    on property: has mouth
    some values from: small mouth
subclass of: Class
  complement of: Restriction
    on property: has mouth
    some values from: StraightLipServingAsTenon
subclass of: Restriction
  on property: has ear location
  some values from: on the rim
subclass of: Class
  complement of: Restriction
    on property: has bottom
    some values from: Tri-lobedBottom
subclass of: Class
  complement of: Restriction
    on property: has part
    some values from: slanting shoulder
subclass of: Class
  complement of: Restriction
    on property: has foot
    some values from: slender and spreading legs
subclass of: Restriction
  on property: has part
  some values from: foot
subclass of: Class
  complement of: Restriction
    on property: has part
    some values from: spout
concept name: <Ding without lid not straight lip serving as tenon not small mouth circular mouth without door without swing-handle without spout without single handle with ears vertical ears on the rim straight not constricted neck not slanting shoulder not constricted waist round body bulging belly not tri-lobed bulging bottom three legs hoof-shaped legs not slender and spreading legs>
definition: Ding with circular mouth,straight vertical ears on the rim,round body,bulging belly,bulging bottom and three hoof-shaped legs
preferred label: 立耳蹄足盆鼎13 @zh
definition: 鼎带圆形口，竖直立耳在口沿上，圆体，鼓腹，圜底，三蹄足 @zh

Hoof-shaped Leg Pending with Vertical Ears 14
type: Class
subclass of: ding
subclass of: Restriction
  on property: has belly shape
  some values from: round body
subclass of: Restriction
  on property: has belly wall
  some values from: bulging belly tapering downwards
subclass of: Class
  complement of: Restriction
    on property: has part
    some values from: lid
subclass of: Restriction
  on property: has foot number
  some values from: ThreeFoot
subclass of: Class
  complement of: Restriction
    on property: has mouth
    some values from: small mouth
subclass of: Restriction
  on property: has part
  some values from: mouth
subclass of: Restriction
  on property: has part
  some values from: belly
subclass of: Class
  complement of: Restriction
    on property: has part
    some values from: door
subclass of: Restriction
  on property: has part
  some values from: bottom
subclass of: Class
  complement of: Restriction
    on property: has part
    some values from: single handle
subclass of: Restriction
  on property: has foot shape
  some values from: hoof-shaped legs
subclass of: Restriction
  on property: has ear shape
  some values from: VerticalEars
subclass of: Class
  complement of: Restriction
    on property: has part
    some values from: constricted waist
subclass of: Class
  complement of: Restriction
    on property: has part
    some values from: spout
subclass of: Class
  complement of: Restriction
    on property: has part
    some values from: constricted neck
subclass of: Class
  complement of: Restriction
    on property: has part
    some values from: Swing-handle
subclass of: Restriction
  on property: has mouth shape
  some values from: circular mouth
subclass of: Restriction
  on property: has bottom shape
  some values from: bulging bottom
subclass of: Restriction
  on property: has part
  some values from: foot
subclass of: Class
  complement of: Restriction
    on property: has bottom
    some values from: Tri-lobedBottom
subclass of: Class
  complement of: Restriction
    on property: has foot
    some values from: slender and spreading legs
subclass of: Restriction
  on property: has part
  some values from: ears
subclass of: Class
  complement of: Restriction
    on property: has part
    some values from: slanting shoulder
subclass of: Restriction
  on property: has ear direction
  some values from: Straight
subclass of: Class
  complement of: Restriction
    on property: has mouth
    some values from: StraightLipServingAsTenon
subclass of: Restriction
  on property: has ear location
  some values from: on the rim
concept name: <Ding without lid not straight lip serving as tenon not small mouth circular mouth without door without swing-handle without spout without single handle with ears vertical ears on the rim straight not constricted neck not slanting shoulder not constricted waist round body bulging belly tapering downwards not tri-lobed bulging bottom three legs hoof-shaped legs not slender and spreading legs>
definition: Ding with circular mouth,straight vertical ears on the rim,round body,bulging belly tapering downwards,bulging bottom and three hoof-shaped legs
preferred label: 立耳蹄足盆鼎14 @zh
definition: 鼎带圆形口，竖直立耳在口沿上，圆体，敛腹，圜底，三蹄足 @zh

Hoof-shaped Leg Pending with Vertical Ears 15
type: Class
subclass of: ding
subclass of: Restriction
  on property: has part
  some values from: mouth
subclass of: Restriction
  on property: has foot number
  some values from: ThreeFoot
subclass of: Class
  complement of: Restriction
    on property: has part
    some values from: door
subclass of: Restriction
  on property: has belly shape
  some values from: round body
subclass of: Class
  complement of: Restriction
    on property: has part
    some values from: spout
subclass of: Class
  complement of: Restriction
    on property: has part
    some values from: constricted neck
subclass of: Restriction
  on property: has part
  some values from: foot
subclass of: Restriction
  on property: has ear direction
  some values from: Spreading
subclass of: Class
  complement of: Restriction
    on property: has mouth
    some values from: StraightLipServingAsTenon
subclass of: Restriction
  on property: has belly wall
  some values from: bulging belly
subclass of: Restriction
  on property: has ear location
  some values from: on the rim
subclass of: Class
  complement of: Restriction
    on property: has part
    some values from: lid
subclass of: Class
  complement of: Restriction
    on property: has part
    some values from: constricted waist
subclass of: Restriction
  on property: has mouth shape
  some values from: circular mouth
subclass of: Class
  complement of: Restriction
    on property: has bottom
    some values from: Tri-lobedBottom
subclass of: Restriction
  on property: has foot shape
  some values from: hoof-shaped legs
subclass of: Class
  complement of: Restriction
    on property: has part
    some values from: Swing-handle
subclass of: Restriction
  on property: has ear shape
  some values from: VerticalEars
subclass of: Restriction
  on property: has part
  some values from: belly
subclass of: Restriction
  on property: has part
  some values from: ears
subclass of: Restriction
  on property: has part
  some values from: bottom
subclass of: Restriction
  on property: has bottom shape
  some values from: bulging bottom
subclass of: Class
  complement of: Restriction
    on property: has part
    some values from: single handle
subclass of: Class
  complement of: Restriction
    on property: has part
    some values from: slanting shoulder
subclass of: Class
  complement of: Restriction
    on property: has mouth
    some values from: small mouth
subclass of: Class
  complement of: Restriction
    on property: has foot
    some values from: slender and spreading legs
concept name: <Ding without lid not straight lip serving as tenon not small mouth circular mouth without door without swing-handle without spout without single handle with ears vertical ears on the rim spreading not constricted neck not slanting shoulder not constricted waist round body bulging belly not tri-lobed bulging bottom three legs hoof-shaped legs not slender and spreading legs>
definition: Ding with circular mouth,spreading vertical ears on the rim,round body,bulging belly,bulging bottom and three hoof-shaped legs
preferred label: 立耳蹄足盆鼎15 @zh
definition: 鼎带圆形口，外撇立耳在口沿上，圆体，鼓腹，圜底，三蹄足 @zh

Hoof-shaped Leg Pending with Vertical Ears 16
type: Class
subclass of: ding
subclass of: Restriction
  on property: has foot shape
  some values from: hoof-shaped legs
subclass of: Restriction
  on property: has belly shape
  some values from: round body
subclass of: Class
  complement of: Restriction
    on property: has part
    some values from: constricted neck
subclass of: Restriction
  on property: has bottom shape
  some values from: slightly bulging bottom
subclass of: Class
  complement of: Restriction
    on property: has part
    some values from: single handle
subclass of: Class
  complement of: Restriction
    on property: has part
    some values from: constricted waist
subclass of: Class
  complement of: Restriction
    on property: has foot
    some values from: slender and spreading legs
subclass of: Restriction
  on property: has ear shape
  some values from: VerticalEars
subclass of: Restriction
  on property: has part
  some values from: belly
subclass of: Class
  complement of: Restriction
    on property: has mouth
    some values from: StraightLipServingAsTenon
subclass of: Restriction
  on property: has foot number
  some values from: ThreeFoot
subclass of: Restriction
  on property: has ear direction
  some values from: Straight
subclass of: Restriction
  on property: has ear location
  some values from: on the rim
subclass of: Class
  complement of: Restriction
    on property: has part
    some values from: door
subclass of: Restriction
  on property: has part
  some values from: mouth
subclass of: Restriction
  on property: has part
  some values from: ears
subclass of: Class
  complement of: Restriction
    on property: has mouth
    some values from: small mouth
subclass of: Class
  complement of: Restriction
    on property: has part
    some values from: lid
subclass of: Restriction
  on property: has part
  some values from: bottom
subclass of: Restriction
  on property: has part
  some values from: foot
subclass of: Class
  complement of: Restriction
    on property: has part
    some values from: Swing-handle
subclass of: Class
  complement of: Restriction
    on property: has part
    some values from: slanting shoulder
subclass of: Class
  complement of: Restriction
    on property: has bottom
    some values from: Tri-lobedBottom
subclass of: Restriction
  on property: has mouth shape
  some values from: circular mouth
subclass of: Class
  complement of: Restriction
    on property: has part
    some values from: spout
subclass of: Restriction
  on property: has belly wall
  some values from: sagging belly
concept name: <Ding without lid not straight lip serving as tenon not small mouth circular mouth without door without swing-handle without spout without single handle with ears vertical ears on the rim straight not constricted neck not slanting shoulder not constricted waist round body sagging belly not tri-lobed slightly bulging bottom three legs hoof-shaped legs not slender and spreading legs>
definition: Ding with circular mouth,straight vertical ears on the rim,round body,sagging belly,slightly bulging bottom and three hoof-shaped legs
preferred label: 立耳蹄足盆鼎16 @zh
definition: 鼎带圆形口，竖直立耳在口沿上，圆体，垂腹，近平底，三蹄足 @zh

Hoof-shaped Leg Pending with Vertical Ears 17
type: Class
subclass of: ding
subclass of: Restriction
  on property: has mouth shape
  some values from: circular mouth
subclass of: Restriction
  on property: has ear location
  some values from: on the rim
subclass of: Class
  complement of: Restriction
    on property: has part
    some values from: constricted waist
subclass of: Class
  complement of: Restriction
    on property: has mouth
    some values from: small mouth
subclass of: Restriction
  on property: has foot number
  some values from: ThreeFoot
subclass of: Class
  complement of: Restriction
    on property: has foot
    some values from: slender and spreading legs
subclass of: Class
  complement of: Restriction
    on property: has bottom
    some values from: Tri-lobedBottom
subclass of: Restriction
  on property: has bottom shape
  some values from: slightly bulging bottom
subclass of: Class
  complement of: Restriction
    on property: has mouth
    some values from: StraightLipServingAsTenon
subclass of: Restriction
  on property: has part
  some values from: mouth
subclass of: Restriction
  on property: has part
  some values from: belly
subclass of: Class
  complement of: Restriction
    on property: has part
    some values from: slanting shoulder
subclass of: Class
  complement of: Restriction
    on property: has part
    some values from: door
subclass of: Restriction
  on property: has part
  some values from: foot
subclass of: Restriction
  on property: has ear shape
  some values from: VerticalEars
subclass of: Restriction
  on property: has belly shape
  some values from: round body
subclass of: Restriction
  on property: has belly wall
  some values from: sagging belly
subclass of: Class
  complement of: Restriction
    on property: has part
    some values from: spout
subclass of: Restriction
  on property: has part
  some values from: constricted neck
subclass of: Class
  complement of: Restriction
    on property: has part
    some values from: Swing-handle
subclass of: Restriction
  on property: has part
  some values from: bottom
subclass of: Class
  complement of: Restriction
    on property: has part
    some values from: single handle
subclass of: Restriction
  on property: has ear direction
  some values from: Straight
subclass of: Restriction
  on property: has part
  some values from: ears
subclass of: Class
  complement of: Restriction
    on property: has part
    some values from: lid
subclass of: Restriction
  on property: has foot shape
  some values from: hoof-shaped legs
concept name: <Ding without lid not straight lip serving as tenon not small mouth circular mouth without door without swing-handle without spout without single handle with ears vertical ears on the rim straight constricted neck not slanting shoulder not constricted waist round body sagging belly not tri-lobed slightly bulging bottom three legs hoof-shaped legs not slender and spreading legs>
definition: Ding with circular mouth,straight vertical ears on the rim,constricted neck,round body,sagging belly,slightly bulging bottom and three hoof-shaped legs
preferred label: 立耳蹄足盆鼎17 @zh
definition: 鼎带圆形口，竖直立耳在口沿上，束颈，圆体，垂腹，近平底，三蹄足 @zh

Hoof-shaped Leg Pending with Vertical Ears 18
type: Class
subclass of: ding
subclass of: Restriction
  on property: has foot number
  some values from: ThreeFoot
subclass of: Restriction
  on property: has part
  some values from: ears
subclass of: Restriction
  on property: has mouth shape
  some values from: circular mouth
subclass of: Restriction
  on property: has part
  some values from: constricted neck
subclass of: Restriction
  on property: has foot shape
  some values from: hoof-shaped legs
subclass of: Restriction
  on property: has belly wall
  some values from: sagging belly
subclass of: Class
  complement of: Restriction
    on property: has part
    some values from: door
subclass of: Class
  complement of: Restriction
    on property: has mouth
    some values from: StraightLipServingAsTenon
subclass of: Restriction
  on property: has belly shape
  some values from: round body
subclass of: Class
  complement of: Restriction
    on property: has foot
    some values from: slender and spreading legs
subclass of: Class
  complement of: Restriction
    on property: has part
    some values from: Swing-handle
subclass of: Restriction
  on property: has ear direction
  some values from: Straight
subclass of: Class
  complement of: Restriction
    on property: has bottom
    some values from: Tri-lobedBottom
subclass of: Class
  complement of: Restriction
    on property: has part
    some values from: constricted waist
subclass of: Class
  complement of: Restriction
    on property: has part
    some values from: spout
subclass of: Restriction
  on property: has ear shape
  some values from: VerticalEars
subclass of: Class
  complement of: Restriction
    on property: has part
    some values from: lid
subclass of: Restriction
  on property: has bottom shape
  some values from: slightly bulging bottom
subclass of: Restriction
  on property: has part
  some values from: foot
subclass of: Class
  complement of: Restriction
    on property: has part
    some values from: single handle
subclass of: Restriction
  on property: has ear location
  some values from: on the rim
subclass of: Restriction
  on property: has part
  some values from: bottom
subclass of: Class
  complement of: Restriction
    on property: has part
    some values from: slanting shoulder
subclass of: Restriction
  on property: has part
  some values from: mouth
subclass of: Class
  complement of: Restriction
    on property: has mouth
    some values from: small mouth
subclass of: Restriction
  on property: has part
  some values from: belly
concept name: <Ding without lid not straight lip serving as tenon not small mouth circular mouth without door without swing-handle without spout without single handle with ears vertical ears on the rim straight constricted neck not slanting shoulder not constricted waist round body sagging belly not tri-lobed slightly bulging bottom three legs hoof-shaped legs not slender and spreading legs>
definition: Ding with circular mouth,straight vertical ears on the rim,constricted neck,round body,sagging belly,slightly bulging bottom and three hoof-shaped legs
preferred label: 立耳蹄足盆鼎18 @zh
definition: 鼎带圆形口，竖直立耳在口沿上，束颈，圆体，垂腹，近平底，三蹄足 @zh

Hoof-shaped Leg Pending with Vertical Ears 19
type: Class
subclass of: ding
subclass of: Restriction
  on property: has foot number
  some values from: ThreeFoot
subclass of: Restriction
  on property: has mouth shape
  some values from: circular mouth
subclass of: Restriction
  on property: has part
  some values from: belly
subclass of: Class
  complement of: Restriction
    on property: has part
    some values from: constricted waist
subclass of: Class
  complement of: Restriction
    on property: has part
    some values from: single handle
subclass of: Class
  complement of: Restriction
    on property: has bottom
    some values from: Tri-lobedBottom
subclass of: Class
  complement of: Restriction
    on property: has part
    some values from: door
subclass of: Class
  complement of: Restriction
    on property: has mouth
    some values from: small mouth
subclass of: Restriction
  on property: has ear location
  some values from: on the rim
subclass of: Restriction
  on property: has ear direction
  some values from: Spreading
subclass of: Restriction
  on property: has bottom shape
  some values from: bulging bottom
subclass of: Class
  complement of: Restriction
    on property: has part
    some values from: constricted neck
subclass of: Restriction
  on property: has foot shape
  some values from: hoof-shaped legs
subclass of: Class
  complement of: Restriction
    on property: has mouth
    some values from: StraightLipServingAsTenon
subclass of: Restriction
  on property: has ear shape
  some values from: VerticalEars
subclass of: Class
  complement of: Restriction
    on property: has part
    some values from: Swing-handle
subclass of: Restriction
  on property: has belly shape
  some values from: round body
subclass of: Class
  complement of: Restriction
    on property: has foot
    some values from: slender and spreading legs
subclass of: Class
  complement of: Restriction
    on property: has part
    some values from: slanting shoulder
subclass of: Restriction
  on property: has part
  some values from: bottom
subclass of: Class
  complement of: Restriction
    on property: has part
    some values from: lid
subclass of: Restriction
  on property: has part
  some values from: ears
subclass of: Restriction
  on property: has part
  some values from: foot
subclass of: Class
  complement of: Restriction
    on property: has part
    some values from: spout
subclass of: Restriction
  on property: has part
  some values from: mouth
subclass of: Restriction
  on property: has belly wall
  some values from: bulging belly tapering downwards
concept name: <Ding with Vertical Ears 19 without lid not straight lip serving as tenon not small mouth circular mouth without door without swing-handle without spout without single handle with ears vertical ears on the rim spreading not constricted neck not slanting shoulder not constricted waist round body bulging belly tapering downwards not tri-lobed bulging bottom three legs hoof-shaped legs not slender and spreading legs>
definition: Ding with circular mouth,spreading vertical ears on the rim,round body,bulging belly tapering downwards,bulging bottom and three hoof-shaped legs
preferred label: 立耳蹄足盆鼎19 @zh
definition: 鼎带圆形口，外撇立耳在口沿上，圆体，敛腹，圜底，三蹄足 @zh

Hoof-shaped Leg Pending with Vertical Ears 2
type: Class
subclass of: ding
subclass of: Class
  complement of: Restriction
    on property: has part
    some values from: door
subclass of: Restriction
  on property: has bottom shape
  some values from: slightly bulging bottom
subclass of: Class
  complement of: Restriction
    on property: has part
    some values from: constricted waist
subclass of: Restriction
  on property: has part
  some values from: bottom
subclass of: Restriction
  on property: has mouth shape
  some values from: circular mouth
subclass of: Restriction
  on property: has ear shape
  some values from: VerticalEars
subclass of: Class
  complement of: Restriction
    on property: has part
    some values from: slanting shoulder
subclass of: Class
  complement of: Restriction
    on property: has foot
    some values from: slender and spreading legs
subclass of: Restriction
  on property: has part
  some values from: mouth
subclass of: Restriction
  on property: has ear direction
  some values from: Straight
subclass of: Restriction
  on property: has belly wall
  some values from: StraightBelly
subclass of: Class
  complement of: Restriction
    on property: has mouth
    some values from: StraightLipServingAsTenon
subclass of: Restriction
  on property: has foot number
  some values from: ThreeFoot
subclass of: Restriction
  on property: has part
  some values from: ears
subclass of: Class
  complement of: Restriction
    on property: has bottom
    some values from: Tri-lobedBottom
subclass of: Restriction
  on property: has ear location
  some values from: on the rim
subclass of: Class
  complement of: Restriction
    on property: has part
    some values from: single handle
subclass of: Class
  complement of: Restriction
    on property: has part
    some values from: spout
subclass of: Class
  complement of: Restriction
    on property: has mouth
    some values from: small mouth
subclass of: Restriction
  on property: has part
  some values from: belly
subclass of: Restriction
  on property: has belly shape
  some values from: round body
subclass of: Class
  complement of: Restriction
    on property: has part
    some values from: constricted neck
subclass of: Restriction
  on property: has part
  some values from: foot
subclass of: Class
  complement of: Restriction
    on property: has part
    some values from: Swing-handle
subclass of: Restriction
  on property: has foot shape
  some values from: hoof-shaped legs
subclass of: Class
  complement of: Restriction
    on property: has part
    some values from: lid
concept name: <Ding without lid not straight lip serving as tenon not small mouth circular mouth without door without swing-handle without spout without single handle with ears vertical ears on the rim straight not constricted neck not slanting shoulder not constricted waist round body straight belly not tri-lobed slightly bulging bottom three legs hoof-shaped legs not slender and spreading legs>
definition: Ding with circular mouth,straight vertical ears on the rim,round body,straight belly,slightly bulging bottom and three hoof-shaped legs
preferred label: 立耳蹄足盆鼎2 @zh
definition: 鼎带圆形口，竖直立耳在口沿上，圆体，直腹，近平底，三蹄足 @zh

Hoof-shaped Leg Pending with Vertical Ears 20
type: Class
subclass of: ding
subclass of: Restriction
  on property: has part
  some values from: belly
subclass of: Restriction
  on property: has belly shape
  some values from: round body
subclass of: Restriction
  on property: has ear location
  some values from: on the rim
subclass of: Restriction
  on property: has mouth shape
  some values from: circular mouth
subclass of: Restriction
  on property: has part
  some values from: mouth
subclass of: Class
  complement of: Restriction
    on property: has bottom
    some values from: Tri-lobedBottom
subclass of: Class
  complement of: Restriction
    on property: has foot
    some values from: slender and spreading legs
subclass of: Class
  complement of: Restriction
    on property: has part
    some values from: constricted waist
subclass of: Restriction
  on property: has foot shape
  some values from: hoof-shaped legs
subclass of: Restriction
  on property: has part
  some values from: bottom
subclass of: Restriction
  on property: has belly wall
  some values from: sagging belly
subclass of: Restriction
  on property: has bottom shape
  some values from: bulging bottom
subclass of: Class
  complement of: Restriction
    on property: has part
    some values from: door
subclass of: Class
  complement of: Restriction
    on property: has part
    some values from: spout
subclass of: Restriction
  on property: has ear shape
  some values from: VerticalEars
subclass of: Restriction
  on property: has ear direction
  some values from: Spreading
subclass of: Class
  complement of: Restriction
    on property: has part
    some values from: lid
subclass of: Class
  complement of: Restriction
    on property: has mouth
    some values from: StraightLipServingAsTenon
subclass of: Class
  complement of: Restriction
    on property: has part
    some values from: Swing-handle
subclass of: Class
  complement of: Restriction
    on property: has part
    some values from: single handle
subclass of: Class
  complement of: Restriction
    on property: has mouth
    some values from: small mouth
subclass of: Restriction
  on property: has foot number
  some values from: ThreeFoot
subclass of: Restriction
  on property: has part
  some values from: foot
subclass of: Restriction
  on property: has part
  some values from: ears
subclass of: Class
  complement of: Restriction
    on property: has part
    some values from: slanting shoulder
subclass of: Class
  complement of: Restriction
    on property: has part
    some values from: constricted neck
concept name: <Ding without lid not straight lip serving as tenon not small mouth circular mouth without door without swing-handle without spout without single handle with ears vertical ears on the rim spreading not constricted neck not slanting shoulder not constricted waist round body sagging belly not tri-lobed bulging bottom three legs hoof-shaped legs not slender and spreading legs>
definition: Ding with circular mouth,spreading vertical ears on the rim,round body,sagging belly,bulging bottom and three hoof-shaped legs
preferred label: 立耳蹄足盆鼎20 @zh
definition: 鼎带圆形口，外撇立耳在口沿上，圆体，垂腹，圜底，三蹄足 @zh

Hoof-shaped Leg Pending with Vertical Ears 3
type: Class
subclass of: ding
subclass of: Restriction
  on property: has ear direction
  some values from: Spreading
subclass of: Class
  complement of: Restriction
    on property: has mouth
    some values from: small mouth
subclass of: Restriction
  on property: has mouth shape
  some values from: circular mouth
subclass of: Restriction
  on property: has belly wall
  some values from: sagging belly
subclass of: Restriction
  on property: has part
  some values from: lid
subclass of: Restriction
  on property: has foot shape
  some values from: hoof-shaped legs
subclass of: Class
  complement of: Restriction
    on property: has part
    some values from: spout
subclass of: Restriction
  on property: has foot number
  some values from: ThreeFoot
subclass of: Class
  complement of: Restriction
    on property: has foot
    some values from: slender and spreading legs
subclass of: Restriction
  on property: has ear shape
  some values from: VerticalEars
subclass of: Restriction
  on property: has part
  some values from: ears
subclass of: Restriction
  on property: has belly shape
  some values from: round body
subclass of: Class
  complement of: Restriction
    on property: has part
    some values from: door
subclass of: Restriction
  on property: has bottom shape
  some values from: bulging bottom
subclass of: Class
  complement of: Restriction
    on property: has mouth
    some values from: StraightLipServingAsTenon
subclass of: Restriction
  on property: has part
  some values from: bottom
subclass of: Restriction
  on property: has ear location
  some values from: on the rim
subclass of: Class
  complement of: Restriction
    on property: has part
    some values from: slanting shoulder
subclass of: Class
  complement of: Restriction
    on property: has part
    some values from: constricted neck
subclass of: Restriction
  on property: has part
  some values from: mouth
subclass of: Restriction
  on property: has part
  some values from: belly
subclass of: Class
  complement of: Restriction
    on property: has bottom
    some values from: Tri-lobedBottom
subclass of: Restriction
  on property: has top shape
  some values from: flat lid
subclass of: Restriction
  on property: has part
  some values from: foot
subclass of: Class
  complement of: Restriction
    on property: has part
    some values from: constricted waist
subclass of: Class
  complement of: Restriction
    on property: has part
    some values from: Swing-handle
subclass of: Class
  complement of: Restriction
    on property: has part
    some values from: single handle
concept name: <Ding with lid flat lid not straight lip serving as tenon not small mouth circular mouth without door without swing-handle without spout without single handle with ears vertical ears on the rim spreading not constricted neck not slanting shoulder not constricted waist round body sagging belly not tri-lobed bulging bottom three legs hoof-shaped legs not slender and spreading legs>
definition: Ding with flat lid,circular mouth,spreading vertical ears on the rim,round body,sagging belly,bulging bottom and three hoof-shaped legs
preferred label: 立耳蹄足盆鼎3 @zh
definition: 鼎带盖，平顶，圆形口，外撇立耳在口沿上，圆体，垂腹，圜底，三蹄足 @zh

Hoof-shaped Leg Pending with Vertical Ears 4
type: Class
subclass of: ding
subclass of: Class
  complement of: Restriction
    on property: has part
    some values from: single handle
subclass of: Restriction
  on property: has foot shape
  some values from: hoof-shaped legs
subclass of: Class
  complement of: Restriction
    on property: has part
    some values from: door
subclass of: Restriction
  on property: has ear shape
  some values from: VerticalEars
subclass of: Restriction
  on property: has top shape
  some values from: domed lid
subclass of: Restriction
  on property: has ear direction
  some values from: Spreading
subclass of: Class
  complement of: Restriction
    on property: has mouth
    some values from: StraightLipServingAsTenon
subclass of: Class
  complement of: Restriction
    on property: has mouth
    some values from: small mouth
subclass of: Restriction
  on property: has belly wall
  some values from: bulging belly
subclass of: Class
  complement of: Restriction
    on property: has part
    some values from: constricted waist
subclass of: Restriction
  on property: has part
  some values from: bottom
subclass of: Restriction
  on property: has ear location
  some values from: on the rim
subclass of: Restriction
  on property: has part
  some values from: belly
subclass of: Class
  complement of: Restriction
    on property: has part
    some values from: slanting shoulder
subclass of: Restriction
  on property: has part
  some values from: ears
subclass of: Restriction
  on property: has belly shape
  some values from: round body
subclass of: Restriction
  on property: has bottom shape
  some values from: bulging bottom
subclass of: Class
  complement of: Restriction
    on property: has foot
    some values from: slender and spreading legs
subclass of: Restriction
  on property: has part
  some values from: foot
subclass of: Restriction
  on property: has mouth shape
  some values from: circular mouth
subclass of: Class
  complement of: Restriction
    on property: has part
    some values from: spout
subclass of: Restriction
  on property: has foot number
  some values from: ThreeFoot
subclass of: Class
  complement of: Restriction
    on property: has bottom
    some values from: Tri-lobedBottom
subclass of: Restriction
  on property: has part
  some values from: lid
subclass of: Class
  complement of: Restriction
    on property: has part
    some values from: Swing-handle
subclass of: Class
  complement of: Restriction
    on property: has part
    some values from: constricted neck
subclass of: Restriction
  on property: has part
  some values from: mouth
concept name: <Ding with lid domed lid not straight lip serving as tenon not small mouth circular mouth without door without swing-handle without spout without single handle with ears vertical ears on the rim spreading not constricted neck not slanting shoulder not constricted waist round body bulging belly not tri-lobed bulging bottom three legs hoof-shaped legs not slender and spreading legs>
definition: Ding with domed lid,circular mouth,spreading vertical ears on the rim,round body,bulging belly,bulging bottom and three hoof-shaped legs
preferred label: 立耳蹄足盆鼎4 @zh
definition: 鼎带盖，圜顶，圆形口，外撇立耳在口沿上，圆体，鼓腹，圜底，三蹄足 @zh

Hoof-shaped Leg Pending with Vertical Ears 5
type: Class
subclass of: ding
subclass of: Class
  complement of: Restriction
    on property: has part
    some values from: lid
subclass of: Restriction
  on property: has ear shape
  some values from: VerticalEars
subclass of: Restriction
  on property: has part
  some values from: foot
subclass of: Restriction
  on property: has belly wall
  some values from: StraightBelly
subclass of: Restriction
  on property: has ear direction
  some values from: Straight
subclass of: Restriction
  on property: has belly shape
  some values from: round body
subclass of: Class
  complement of: Restriction
    on property: has part
    some values from: single handle
subclass of: Class
  complement of: Restriction
    on property: has part
    some values from: spout
subclass of: Restriction
  on property: has foot number
  some values from: ThreeFoot
subclass of: Class
  complement of: Restriction
    on property: has part
    some values from: constricted waist
subclass of: Restriction
  on property: has part
  some values from: mouth
subclass of: Restriction
  on property: has part
  some values from: belly
subclass of: Restriction
  on property: has bottom shape
  some values from: bulging bottom
subclass of: Restriction
  on property: has ear location
  some values from: on the rim
subclass of: Class
  complement of: Restriction
    on property: has foot
    some values from: slender and spreading legs
subclass of: Restriction
  on property: has part
  some values from: bottom
subclass of: Class
  complement of: Restriction
    on property: has bottom
    some values from: Tri-lobedBottom
subclass of: Restriction
  on property: has foot shape
  some values from: hoof-shaped legs
subclass of: Class
  complement of: Restriction
    on property: has part
    some values from: door
subclass of: Class
  complement of: Restriction
    on property: has part
    some values from: slanting shoulder
subclass of: Restriction
  on property: has part
  some values from: ears
subclass of: Class
  complement of: Restriction
    on property: has mouth
    some values from: small mouth
subclass of: Class
  complement of: Restriction
    on property: has part
    some values from: Swing-handle
subclass of: Class
  complement of: Restriction
    on property: has part
    some values from: constricted neck
subclass of: Class
  complement of: Restriction
    on property: has mouth
    some values from: StraightLipServingAsTenon
subclass of: Restriction
  on property: has mouth shape
  some values from: circular mouth
concept name: <Ding without lid not straight lip serving as tenon not small mouth circular mouth without door without swing-handle without spout without single handle with ears vertical ears on the rim straight not constricted neck not slanting shoulder not constricted waist round body straight belly not tri-lobed bulging bottom three legs hoof-shaped legs not slender and spreading legs>
definition: Ding with circular mouth,straight vertical ears on the rim,round body,straight belly,bulging bottom and three hoof-shaped legs
preferred label: 立耳蹄足盆鼎5 @zh
definition: 鼎带圆形口，竖直立耳在口沿上，圆体，直腹，圜底，三蹄足 @zh

Hoof-shaped Leg Pending with Vertical Ears 6
type: Class
subclass of: ding
subclass of: Class
  complement of: Restriction
    on property: has mouth
    some values from: StraightLipServingAsTenon
subclass of: Restriction
  on property: has ear direction
  some values from: Spreading
subclass of: Class
  complement of: Restriction
    on property: has part
    some values from: constricted waist
subclass of: Class
  complement of: Restriction
    on property: has part
    some values from: Swing-handle
subclass of: Restriction
  on property: has bottom shape
  some values from: bulging bottom
subclass of: Restriction
  on property: has part
  some values from: foot
subclass of: Class
  complement of: Restriction
    on property: has part
    some values from: lid
subclass of: Restriction
  on property: has foot shape
  some values from: hoof-shaped legs
subclass of: Class
  complement of: Restriction
    on property: has foot
    some values from: slender and spreading legs
subclass of: Restriction
  on property: has belly shape
  some values from: round body
subclass of: Restriction
  on property: has ear location
  some values from: on the rim
subclass of: Class
  complement of: Restriction
    on property: has bottom
    some values from: Tri-lobedBottom
subclass of: Restriction
  on property: has part
  some values from: mouth
subclass of: Class
  complement of: Restriction
    on property: has part
    some values from: door
subclass of: Restriction
  on property: has mouth shape
  some values from: circular mouth
subclass of: Restriction
  on property: has part
  some values from: constricted neck
subclass of: Class
  complement of: Restriction
    on property: has part
    some values from: spout
subclass of: Restriction
  on property: has belly wall
  some values from: bulging belly tapering downwards
subclass of: Restriction
  on property: has part
  some values from: belly
subclass of: Restriction
  on property: has ear shape
  some values from: VerticalEars
subclass of: Restriction
  on property: has part
  some values from: ears
subclass of: Class
  complement of: Restriction
    on property: has mouth
    some values from: small mouth
subclass of: Restriction
  on property: has part
  some values from: bottom
subclass of: Class
  complement of: Restriction
    on property: has part
    some values from: single handle
subclass of: Class
  complement of: Restriction
    on property: has part
    some values from: slanting shoulder
subclass of: Restriction
  on property: has foot number
  some values from: ThreeFoot
concept name: <Ding without lid not straight lip serving as tenon not small mouth circular mouth without door without swing-handle without spout without single handle with ears vertical ears on the rim spreading constricted neck not slanting shoulder not constricted waist round body bulging belly tapering downwards not tri-lobed bulging bottom three legs hoof-shaped legs not slender and spreading legs>
definition: Ding with circular mouth,spreading vertical ears on the rim,constricted neck,round body,bulging belly tapering downwards,bulging bottom and three hoof-shaped legs
preferred label: 立耳蹄足盆鼎6 @zh
definition: 鼎带圆形口，外撇立耳在口沿上, 束颈，圆体，敛腹，圜底，三蹄足 @zh

Hoof-shaped Leg Pending with Vertical Ears 7
type: Class
subclass of: ding
subclass of: Class
  complement of: Restriction
    on property: has part
    some values from: spout
subclass of: Restriction
  on property: has belly shape
  some values from: round body
subclass of: Class
  complement of: Restriction
    on property: has mouth
    some values from: StraightLipServingAsTenon
subclass of: Restriction
  on property: has part
  some values from: ears
subclass of: Restriction
  on property: has ear direction
  some values from: Spreading
subclass of: Restriction
  on property: has ear location
  some values from: on the rim
subclass of: Restriction
  on property: has part
  some values from: belly
subclass of: Class
  complement of: Restriction
    on property: has part
    some values from: constricted waist
subclass of: Restriction
  on property: has foot shape
  some values from: hoof-shaped legs
subclass of: Class
  complement of: Restriction
    on property: has part
    some values from: Swing-handle
subclass of: Class
  complement of: Restriction
    on property: has part
    some values from: constricted neck
subclass of: Restriction
  on property: has part
  some values from: mouth
subclass of: Restriction
  on property: has part
  some values from: foot
subclass of: Restriction
  on property: has ear shape
  some values from: VerticalEars
subclass of: Class
  complement of: Restriction
    on property: has part
    some values from: door
subclass of: Class
  complement of: Restriction
    on property: has part
    some values from: single handle
subclass of: Class
  complement of: Restriction
    on property: has part
    some values from: slanting shoulder
subclass of: Class
  complement of: Restriction
    on property: has part
    some values from: lid
subclass of: Class
  complement of: Restriction
    on property: has mouth
    some values from: small mouth
subclass of: Class
  complement of: Restriction
    on property: has bottom
    some values from: Tri-lobedBottom
subclass of: Restriction
  on property: has foot number
  some values from: ThreeFoot
subclass of: Class
  complement of: Restriction
    on property: has foot
    some values from: slender and spreading legs
subclass of: Restriction
  on property: has mouth shape
  some values from: circular mouth
subclass of: Restriction
  on property: has belly wall
  some values from: StraightBelly
concept name: <Ding without lid not straight lip serving as tenon not small mouth circular mouth without door without swing-handle without spout without single handle with ears vertical ears on the rim spreading not constricted neck not slanting shoulder not constricted waist round body straight belly not tri-lobed bulging bottom three legs hoof-shaped legs not slender and spreading legs>
definition: Ding with circular mouth,spreading vertical ears on the rim,round body,straight belly,bulging bottom and three hoof-shaped legs
preferred label: 立耳蹄足盆鼎7 @zh
definition: 鼎带圆形口，外撇立耳在口沿上，圆体，直腹，圜底，三蹄足 @zh

Hoof-shaped Leg Pending with Vertical Ears 8
type: Class
subclass of: ding
subclass of: Class
  complement of: Restriction
    on property: has part
    some values from: spout
subclass of: Class
  complement of: Restriction
    on property: has mouth
    some values from: StraightLipServingAsTenon
subclass of: Class
  complement of: Restriction
    on property: has part
    some values from: door
subclass of: Class
  complement of: Restriction
    on property: has mouth
    some values from: small mouth
subclass of: Restriction
  on property: has part
  some values from: bottom
subclass of: Class
  complement of: Restriction
    on property: has part
    some values from: slanting shoulder
subclass of: Class
  complement of: Restriction
    on property: has part
    some values from: constricted waist
subclass of: Restriction
  on property: has top shape
  some values from: flat lid
subclass of: Class
  complement of: Restriction
    on property: has part
    some values from: constricted neck
subclass of: Restriction
  on property: has part
  some values from: mouth
subclass of: Restriction
  on property: has part
  some values from: lid
subclass of: Class
  complement of: Restriction
    on property: has part
    some values from: single handle
subclass of: Restriction
  on property: has belly shape
  some values from: round body
subclass of: Restriction
  on property: has part
  some values from: ears
subclass of: Restriction
  on property: has bottom shape
  some values from: bulging bottom
subclass of: Restriction
  on property: has mouth shape
  some values from: circular mouth
subclass of: Restriction
  on property: has part
  some values from: belly
subclass of: Restriction
  on property: has belly wall
  some values from: bulging belly tapering downwards
subclass of: Class
  complement of: Restriction
    on property: has foot
    some values from: slender and spreading legs
subclass of: Restriction
  on property: has foot number
  some values from: ThreeFoot
subclass of: Restriction
  on property: has foot shape
  some values from: hoof-shaped legs
subclass of: Class
  complement of: Restriction
    on property: has part
    some values from: Swing-handle
subclass of: Class
  complement of: Restriction
    on property: has bottom
    some values from: Tri-lobedBottom
subclass of: Restriction
  on property: has ear location
  some values from: on the rim
subclass of: Restriction
  on property: has part
  some values from: foot
subclass of: Restriction
  on property: has ear direction
  some values from: Straight
subclass of: Restriction
  on property: has ear shape
  some values from: VerticalEars
concept name: <Ding with lid flat lid not straight lip serving as tenon not small mouth circular mouth without door without swing-handle without spout without single handle with ears vertical ears on the rim straight not constricted neck not slanting shoulder not constricted waist round body bulging belly tapering downwards not tri-lobed bulging bottom three legs hoof-shaped legs not slender and spreading legs>
definition: Ding with flat lid,circular mouth,straight vertical ears on the rim,round body,bulging belly tapering downwards,bulging bottom and three hoof-shaped legs
preferred label: 立耳蹄足盆鼎8 @zh
definition: 鼎带盖，平顶，圆形口，竖直立耳在口沿上，圆体，敛腹，圜底，三蹄足 @zh

Hoof-shaped Leg Pending with Vertical Ears 9
type: Class
subclass of: ding
subclass of: Class
  complement of: Restriction
    on property: has mouth
    some values from: small mouth
subclass of: Restriction
  on property: has mouth shape
  some values from: circular mouth
subclass of: Restriction
  on property: has bottom shape
  some values from: bulging bottom
subclass of: Restriction
  on property: has ear location
  some values from: on the rim
subclass of: Restriction
  on property: has belly wall
  some values from: bulging belly tapering downwards
subclass of: Class
  complement of: Restriction
    on property: has bottom
    some values from: Tri-lobedBottom
subclass of: Class
  complement of: Restriction
    on property: has part
    some values from: constricted neck
subclass of: Restriction
  on property: has ear direction
  some values from: Straight
subclass of: Restriction
  on property: has foot number
  some values from: ThreeFoot
subclass of: Restriction
  on property: has belly shape
  some values from: round body
subclass of: Class
  complement of: Restriction
    on property: has part
    some values from: single handle
subclass of: Restriction
  on property: has part
  some values from: mouth
subclass of: Class
  complement of: Restriction
    on property: has part
    some values from: slanting shoulder
subclass of: Class
  complement of: Restriction
    on property: has part
    some values from: Swing-handle
subclass of: Class
  complement of: Restriction
    on property: has part
    some values from: constricted waist
subclass of: Class
  complement of: Restriction
    on property: has foot
    some values from: slender and spreading legs
subclass of: Restriction
  on property: has part
  some values from: foot
subclass of: Restriction
  on property: has foot shape
  some values from: hoof-shaped legs
subclass of: Class
  complement of: Restriction
    on property: has part
    some values from: spout
subclass of: Restriction
  on property: has part
  some values from: ears
subclass of: Class
  complement of: Restriction
    on property: has part
    some values from: lid
subclass of: Class
  complement of: Restriction
    on property: has mouth
    some values from: StraightLipServingAsTenon
subclass of: Class
  complement of: Restriction
    on property: has part
    some values from: door
subclass of: Restriction
  on property: has ear shape
  some values from: VerticalEars
subclass of: Restriction
  on property: has part
  some values from: bottom
subclass of: Restriction
  on property: has part
  some values from: belly
concept name: <Ding without lid not straight lip serving as tenon not small mouth circular mouth without door without swing-handle without spout without single handle with ears vertical ears on the rim straight not constricted neck not slanting shoulder not constricted waist round body bulging belly tapering downwards not tri-lobed bulging bottom three legs hoof-shaped legs not slender and spreading legs>
definition: Ding with circular mouth,straight vertical ears on the rim,round body,bulging belly tapering downwards,bulging bottom and three hoof-shaped legs
preferred label: 立耳蹄足盆鼎9 @zh
definition: 鼎带圆形口，竖直立耳在口沿上，圆体，敛腹，圜底，三蹄足 @zh

Hoof-shaped Leg Rectangular Ding 1
type: Class
subclass of: ding
subclass of: Class
  complement of: Restriction
    on property: has part
    some values from: slanting shoulder
subclass of: Class
  complement of: Restriction
    on property: has mouth
    some values from: small mouth
subclass of: Class
  complement of: Restriction
    on property: has part
    some values from: spout
subclass of: Restriction
  on property: has part
  some values from: belly
subclass of: Class
  complement of: Restriction
    on property: has mouth
    some values from: StraightLipServingAsTenon
subclass of: Restriction
  on property: has ear location
  some values from: on the rim
subclass of: Restriction
  on property: has top shape
  some values from: flat lid
subclass of: Restriction
  on property: has mouth shape
  some values from: rectangular mouth
subclass of: Restriction
  on property: has belly wall
  some values from: StraightBelly
subclass of: Restriction
  on property: has belly shape
  some values from: rectangular body
subclass of: Class
  complement of: Restriction
    on property: has part
    some values from: single handle
subclass of: Restriction
  on property: has ear shape
  some values from: VerticalEars
subclass of: Restriction
  on property: has ear direction
  some values from: Straight
subclass of: Restriction
  on property: has part
  some values from: foot
subclass of: Class
  complement of: Restriction
    on property: has bottom
    some values from: Tri-lobedBottom
subclass of: Class
  complement of: Restriction
    on property: has part
    some values from: Swing-handle
subclass of: Restriction
  on property: has part
  some values from: mouth
subclass of: Restriction
  on property: has part
  some values from: lid
subclass of: Restriction
  on property: has foot shape
  some values from: hoof-shaped legs
subclass of: Restriction
  on property: has part
  some values from: bottom
subclass of: Class
  complement of: Restriction
    on property: has part
    some values from: door
subclass of: Class
  complement of: Restriction
    on property: has foot
    some values from: slender and spreading legs
subclass of: Class
  complement of: Restriction
    on property: has part
    some values from: constricted neck
subclass of: Restriction
  on property: has bottom shape
  some values from: flat bottom
subclass of: Restriction
  on property: has foot number
  some values from: ThreeFoot
subclass of: Restriction
  on property: has part
  some values from: ears
subclass of: Class
  complement of: Restriction
    on property: has part
    some values from: constricted waist
concept name: <Ding with lid flat lid not straight lip serving as tenon not small mouth rectangular mouth without door without swing-handle without spout without single handle with ears vertical ears on the rim straight not constricted neck not slanting shoulder not constricted waist rectangular body straight belly not tri-lobed flat bottom four legs hoof-shaped legs not slender and spreading legs>
definition: Ding with flat lid,rectangular mouth,straight vertical ears on the rim,rectangular body,straight belly,flat bottom and four hoof-shaped legs
preferred label: 蹄足方鼎1 @zh
definition: 鼎带盖，平顶，长方形口，竖直立耳在口沿上，长方体，直腹，平底，四蹄足 @zh

hoof-shaped legs
type: Class
subclass of: foot shape
disjoint with: similar conical legs
disjoint with: similar hoof-shaped legs
disjoint with: Trisquare-shapedLegs
preferred label: 蹄足 @zh

Jian
type: Class
subclass of: stone
subclass of: Restriction
  on property: hasFunction
  some values from: 战争武器
preferred label: 剑 @zh

Jue
type: Class
subclass of: stone
subclass of: Restriction
  on property: hasFunction
  some values from: 用于饮酒
preferred label: 爵 @zh

lid
type: Class
subclass of: part
preferred label: 盖 @zh

location of ears
type: Class
subclass of: ears
preferred label: 耳的位置 @zh

mouth
type: Class
subclass of: part
preferred label: 口 @zh

mouth shape
type: Class
subclass of: mouth
preferred label: 口形 @zh

neck
type: Class
subclass of: part
preferred label: 颈 @zh

oblong body
type: Class
subclass of: belly shape
disjoint with: rectangular body
disjoint with: round body
preferred label: 椭方体 @zh

oblong mouth
type: Class
subclass of: mouth shape
disjoint with: rectangular mouth
disjoint with: SquareMouth
preferred label: 椭方形口 @zh

on the rim
type: Class
subclass of: location of ears
disjoint with: UnderTheRim
preferred label: 口沿上 @zh

on the shoulder
type: Class
subclass of: location of ears
preferred label: 在肩部 @zh

others
type: Class
subclass of: stone
preferred label: 杂器 @zh

part
type: Class
preferred label: 部分 @zh

place
type: Class
preferred label: 地点 @zh

rectangular body
type: Class
subclass of: belly shape
disjoint with: round body
preferred label: 长方体 @zh

rectangular mouth
type: Class
subclass of: mouth shape
disjoint with: SquareMouth
preferred label: 长方形口 @zh

round body
type: Class
subclass of: belly shape
preferred label: 圆体 @zh

sagging belly
type: Class
subclass of: belly wall
disjoint with: StraightBelly
preferred label: 垂腹 @zh

semi-circular ears
type: Class
subclass of: shape of ears
disjoint with: side ears
disjoint with: VerticalEars
preferred label: 半环耳 @zh

shape of ears
type: Class
subclass of: ears
preferred label: 耳形状 @zh

Shengding 1
type: Class
subclass of: ding
subclass of: Restriction
  on property: has part
  some values from: ears
subclass of: Class
  complement of: Restriction
    on property: has part
    some values from: door
subclass of: Class
  complement of: Restriction
    on property: has part
    some values from: slanting shoulder
subclass of: Restriction
  on property: has belly shape
  some values from: round body
subclass of: Class
  complement of: Restriction
    on property: has part
    some values from: lid
subclass of: Class
  complement of: Restriction
    on property: has foot
    some values from: slender and spreading legs
subclass of: Class
  complement of: Restriction
    on property: has part
    some values from: constricted neck
subclass of: Restriction
  on property: has part
  some values from: mouth
subclass of: Class
  complement of: Restriction
    on property: has bottom
    some values from: Tri-lobedBottom
subclass of: Restriction
  on property: has bottom shape
  some values from: flat bottom
subclass of: Restriction
  on property: has mouth shape
  some values from: circular mouth
subclass of: Restriction
  on property: has ear direction
  some values from: Spreading
subclass of: Restriction
  on property: has part
  some values from: bottom
subclass of: Restriction
  on property: has ear location
  some values from: on the rim
subclass of: Restriction
  on property: has part
  some values from: constricted waist
subclass of: Class
  complement of: Restriction
    on property: has mouth
    some values from: small mouth
subclass of: Class
  complement of: Restriction
    on property: has part
    some values from: spout
subclass of: Restriction
  on property: has foot shape
  some values from: hoof-shaped legs
subclass of: Restriction
  on property: has part
  some values from: belly
subclass of: Class
  complement of: Restriction
    on property: has mouth
    some values from: StraightLipServingAsTenon
subclass of: Class
  complement of: Restriction
    on property: has part
    some values from: single handle
subclass of: Restriction
  on property: has ear shape
  some values from: VerticalEars
subclass of: Restriction
  on property: has foot number
  some values from: ThreeFoot
subclass of: Class
  complement of: Restriction
    on property: has part
    some values from: Swing-handle
subclass of: Restriction
  on property: has part
  some values from: foot
concept name: <Ding without lid not straight lip serving as tenon not small mouth circular mouth without door without swing-handle without spout without single handle with ears vertical ears on the rim spreading not constricted neck not slanting shoulder constricted waist round body constricted-waist belly not tri-lobed flat bottom three legs hoof-shaped legs not slender and spreading legs>
definition: Ding with circular mouth,spreading vertical ears on the rim,constricted waist,round body,constricted-waist belly,flat bottom and three hoof-shaped legs
preferred label: 升鼎1 @zh
definition: 鼎带圆形口，外撇立耳在口沿上，束腰，圆体，平底，三蹄足 @zh

Shengding 2
type: Class
subclass of: ding
subclass of: Restriction
  on property: has ear location
  some values from: on the rim
subclass of: Restriction
  on property: has top shape
  some values from: flat lid
subclass of: Restriction
  on property: has part
  some values from: bottom
subclass of: Class
  complement of: Restriction
    on property: has mouth
    some values from: StraightLipServingAsTenon
subclass of: Restriction
  on property: has bottom shape
  some values from: flat bottom
subclass of: Class
  complement of: Restriction
    on property: has part
    some values from: door
subclass of: Restriction
  on property: has part
  some values from: foot
subclass of: Restriction
  on property: has part
  some values from: constricted waist
subclass of: Class
  complement of: Restriction
    on property: has part
    some values from: single handle
subclass of: Restriction
  on property: has belly shape
  some values from: round body
subclass of: Class
  complement of: Restriction
    on property: has part
    some values from: Swing-handle
subclass of: Class
  complement of: Restriction
    on property: has foot
    some values from: slender and spreading legs
subclass of: Class
  complement of: Restriction
    on property: has mouth
    some values from: small mouth
subclass of: Restriction
  on property: has part
  some values from: lid
subclass of: Restriction
  on property: has foot shape
  some values from: hoof-shaped legs
subclass of: Restriction
  on property: has part
  some values from: ears
subclass of: Class
  complement of: Restriction
    on property: has part
    some values from: constricted neck
subclass of: Restriction
  on property: has mouth shape
  some values from: circular mouth
subclass of: Restriction
  on property: has ear direction
  some values from: Spreading
subclass of: Restriction
  on property: has part
  some values from: mouth
subclass of: Restriction
  on property: has part
  some values from: belly
subclass of: Class
  complement of: Restriction
    on property: has bottom
    some values from: Tri-lobedBottom
subclass of: Restriction
  on property: has ear shape
  some values from: VerticalEars
subclass of: Class
  complement of: Restriction
    on property: has part
    some values from: spout
subclass of: Restriction
  on property: has foot number
  some values from: ThreeFoot
subclass of: Class
  complement of: Restriction
    on property: has part
    some values from: slanting shoulder
concept name: <Ding with lid flat lid not straight lip serving as tenon not small mouth circular mouth without door without swing-handle without spout without single handle with ears vertical ears on the rim spreading not constricted neck not slanting shoulder constricted waist round body constricted-waist belly not tri-lobed flat bottom three legs hoof-shaped legs not slender and spreading legs>
concept name: Ding with flat lid,circular mouth,spreading vertical ears on the rim,constricted waist,round body,constricted-waist belly,flat bottom and three hoof-shaped legs
preferred label: 升鼎2 @zh
concept name: 鼎带盖，平顶，圆形口，外撇立耳在口沿上，束腰，圆体，平底，三蹄足 @zh

Shengding 3
type: Class
subclass of: ding
subclass of: Class
  complement of: Restriction
    on property: has mouth
    some values from: StraightLipServingAsTenon
subclass of: Restriction
  on property: has part
  some values from: mouth
subclass of: Class
  complement of: Restriction
    on property: has foot
    some values from: slender and spreading legs
subclass of: Restriction
  on property: has foot shape
  some values from: hoof-shaped legs
subclass of: Restriction
  on property: has ear direction
  some values from: Spreading
subclass of: Class
  complement of: Restriction
    on property: has part
    some values from: single handle
subclass of: Class
  complement of: Restriction
    on property: has bottom
    some values from: Tri-lobedBottom
subclass of: Restriction
  on property: has belly shape
  some values from: round body
subclass of: Class
  complement of: Restriction
    on property: has part
    some values from: slanting shoulder
subclass of: Restriction
  on property: has bottom shape
  some values from: flat bottom
subclass of: Restriction
  on property: has belly wall
  some values from: StraightBelly
subclass of: Restriction
  on property: has ear location
  some values from: on the rim
subclass of: Restriction
  on property: has foot number
  some values from: ThreeFoot
subclass of: Class
  complement of: Restriction
    on property: has part
    some values from: lid
subclass of: Restriction
  on property: has part
  some values from: constricted waist
subclass of: Restriction
  on property: has part
  some values from: foot
subclass of: Class
  complement of: Restriction
    on property: has part
    some values from: spout
subclass of: Restriction
  on property: has part
  some values from: ears
subclass of: Restriction
  on property: has part
  some values from: bottom
subclass of: Restriction
  on property: has ear shape
  some values from: VerticalEars
subclass of: Class
  complement of: Restriction
    on property: has part
    some values from: constricted neck
subclass of: Class
  complement of: Restriction
    on property: has part
    some values from: Swing-handle
subclass of: Restriction
  on property: has mouth shape
  some values from: circular mouth
subclass of: Class
  complement of: Restriction
    on property: has part
    some values from: door
subclass of: Class
  complement of: Restriction
    on property: has mouth
    some values from: small mouth
concept name: <Ding without lid not straight lip serving as tenon not small mouth circular mouth without door without swing-handle without spout without single handle with ears vertical ears on the rim spreading not constricted neck not slanting shoulder constricted waist round body straight belly not tri-lobed flat bottom three legs hoof-shaped legs not slender and spreading legs>
definition: Ding with circular mouth,spreading vertical ears on the rim,constricted waist,round body,straight belly,flat bottom and three hoof-shaped legs
preferred label: 升鼎3 @zh
definition: 鼎带圆形口，外撇立耳在口沿上，束腰，圆体，直腹，平底，三蹄足 @zh

Shengding 4
type: Class
subclass of: ding
subclass of: Restriction
  on property: has part
  some values from: mouth
subclass of: Restriction
  on property: has mouth shape
  some values from: circular mouth
subclass of: Restriction
  on property: has part
  some values from: belly
subclass of: Restriction
  on property: has part
  some values from: constricted neck
subclass of: Class
  complement of: Restriction
    on property: has mouth
    some values from: StraightLipServingAsTenon
subclass of: Restriction
  on property: has belly wall
  some values from: bulging belly
subclass of: Class
  complement of: Restriction
    on property: has part
    some values from: constricted waist
subclass of: Restriction
  on property: has ear direction
  some values from: Spreading
subclass of: Class
  complement of: Restriction
    on property: has part
    some values from: spout
subclass of: Class
  complement of: Restriction
    on property: has part
    some values from: single handle
subclass of: Class
  complement of: Restriction
    on property: has part
    some values from: Swing-handle
subclass of: Class
  complement of: Restriction
    on property: has bottom
    some values from: Tri-lobedBottom
subclass of: Restriction
  on property: has foot number
  some values from: ThreeFoot
subclass of: Restriction
  on property: has part
  some values from: foot
subclass of: Restriction
  on property: has ear shape
  some values from: VerticalEars
subclass of: Restriction
  on property: has bottom shape
  some values from: flat bottom
subclass of: Restriction
  on property: has part
  some values from: ears
subclass of: Restriction
  on property: has foot shape
  some values from: hoof-shaped legs
subclass of: Class
  complement of: Restriction
    on property: has part
    some values from: slanting shoulder
subclass of: Class
  complement of: Restriction
    on property: has mouth
    some values from: small mouth
subclass of: Restriction
  on property: has belly shape
  some values from: round body
subclass of: Class
  complement of: Restriction
    on property: has part
    some values from: lid
subclass of: Restriction
  on property: has part
  some values from: bottom
subclass of: Class
  complement of: Restriction
    on property: has part
    some values from: door
subclass of: Restriction
  on property: has ear location
  some values from: on the rim
subclass of: Class
  complement of: Restriction
    on property: has foot
    some values from: slender and spreading legs
concept name: <Ding without lid not straight lip serving as tenon not small mouth circular mouth without door without swing-handle without spout without single handle with ears vertical ears on the rim spreading constricted neck not slanting shoulder not constricted waist round body bulging belly not tri-lobed flat bottom three legs hoof-shaped legs not slender and spreading legs>
definition: Ding with circular mouth,spreading vertical ears on the rim,constricted neck,round body,bulging belly,flat bottom and three hoof-shaped legs
preferred label: 升鼎4 @zh
definition: 鼎带圆形口，外撇立耳在口沿上，束颈，圆体，鼓腹，平底，三蹄足 @zh

Shengding 5
type: Class
subclass of: ding
subclass of: Class
  complement of: Restriction
    on property: has mouth
    some values from: small mouth
subclass of: Restriction
  on property: has part
  some values from: constricted waist
subclass of: Class
  complement of: Restriction
    on property: has part
    some values from: lid
subclass of: Restriction
  on property: has part
  some values from: belly
subclass of: Class
  complement of: Restriction
    on property: has part
    some values from: slanting shoulder
subclass of: Restriction
  on property: has belly shape
  some values from: round body
subclass of: Class
  complement of: Restriction
    on property: has part
    some values from: spout
subclass of: Restriction
  on property: has foot shape
  some values from: hoof-shaped legs
subclass of: Restriction
  on property: has ear shape
  some values from: side ears
subclass of: Class
  complement of: Restriction
    on property: has foot
    some values from: slender and spreading legs
subclass of: Restriction
  on property: has ear location
  some values from: UnderTheRim
subclass of: Class
  complement of: Restriction
    on property: has part
    some values from: single handle
subclass of: Restriction
  on property: has part
  some values from: foot
subclass of: Class
  complement of: Restriction
    on property: has part
    some values from: constricted neck
subclass of: Class
  complement of: Restriction
    on property: has bottom
    some values from: Tri-lobedBottom
subclass of: Restriction
  on property: has belly wall
  some values from: constricted-waist belly
subclass of: Restriction
  on property: has foot number
  some values from: ThreeFoot
subclass of: Restriction
  on property: has part
  some values from: ears
subclass of: Class
  complement of: Restriction
    on property: has mouth
    some values from: StraightLipServingAsTenon
subclass of: Restriction
  on property: has ear direction
  some values from: Straight
subclass of: Restriction
  on property: has mouth shape
  some values from: circular mouth
subclass of: Restriction
  on property: has part
  some values from: mouth
subclass of: Class
  complement of: Restriction
    on property: has part
    some values from: door
subclass of: Class
  complement of: Restriction
    on property: has part
    some values from: Swing-handle
subclass of: Restriction
  on property: has bottom shape
  some values from: flat bottom
subclass of: Restriction
  on property: has part
  some values from: bottom
concept name: <Ding without lid not straight lip serving as tenon not small mouth circular mouth without door without swing-handle without spout without single handle with ears side ears under the rim straight not constricted neck not slanting shoulder constricted waist round body constricted-waist belly not tri-lobed flat bottom three legs hoof-shaped legs not slender and spreading legs>
definition: Ding with circular mouth,straight side ears under the rim,constricted waist,round body,constricted-waist belly,flat bottom and three hoof-shaped legs
preferred label: 升鼎5 @zh
definition: 鼎带圆形口，竖直附耳在口沿下，束腰，束腰腹，圆体，平底，三蹄足 @zh

Shengding 6
type: Class
subclass of: ding
subclass of: Class
  complement of: Restriction
    on property: has part
    some values from: spout
subclass of: Class
  complement of: Restriction
    on property: has bottom
    some values from: Tri-lobedBottom
subclass of: Class
  complement of: Restriction
    on property: has part
    some values from: door
subclass of: Restriction
  on property: has foot number
  some values from: ThreeFoot
subclass of: Class
  complement of: Restriction
    on property: has mouth
    some values from: StraightLipServingAsTenon
subclass of: Restriction
  on property: has ear direction
  some values from: Straight
subclass of: Class
  complement of: Restriction
    on property: has part
    some values from: single handle
subclass of: Restriction
  on property: has ear shape
  some values from: side ears
subclass of: Class
  complement of: Restriction
    on property: has part
    some values from: Swing-handle
subclass of: Restriction
  on property: has part
  some values from: mouth
subclass of: Class
  complement of: Restriction
    on property: has part
    some values from: slanting shoulder
subclass of: Class
  complement of: Restriction
    on property: has mouth
    some values from: small mouth
subclass of: Restriction
  on property: has part
  some values from: bottom
subclass of: Class
  complement of: Restriction
    on property: has foot
    some values from: slender and spreading legs
subclass of: Restriction
  on property: has bottom shape
  some values from: slightly bulging bottom
subclass of: Restriction
  on property: has ear location
  some values from: UnderTheRim
subclass of: Restriction
  on property: has part
  some values from: foot
subclass of: Class
  complement of: Restriction
    on property: has part
    some values from: constricted neck
subclass of: Restriction
  on property: has belly shape
  some values from: round body
subclass of: Restriction
  on property: has belly wall
  some values from: constricted-waist belly
subclass of: Restriction
  on property: has part
  some values from: constricted waist
subclass of: Restriction
  on property: has part
  some values from: ears
subclass of: Restriction
  on property: has part
  some values from: belly
subclass of: Restriction
  on property: has foot shape
  some values from: hoof-shaped legs
subclass of: Class
  complement of: Restriction
    on property: has part
    some values from: lid
subclass of: Restriction
  on property: has mouth shape
  some values from: circular mouth
concept name: <Ding without lid not straight lip serving as tenon not small mouth circular mouth without door without swing-handle without spout without single handle with ears side ears under the rim straight not constricted neck not slanting shoulder constricted waist round body constricted-waist belly not tri-lobed slightly bulging bottom three legs hoof-shaped legs not slender and spreading legs>
definition: Ding with circular mouth,straight side ears under the rim,constricted waist,round body,constricted-waist belly,slightly bulging bottom and three hoof-shaped legs
preferred label: 升鼎6 @zh
definition: 鼎带圆形口，竖直附耳在口沿下，束腰，束腰腹，圆体，近平底，三蹄足 @zh

shoulder
type: Class
subclass of: part
preferred label: 肩 @zh

side ears
type: Class
subclass of: shape of ears
disjoint with: VerticalEars
preferred label: 附耳 @zh

Similar Conical-legged Guanding 1
type: Class
subclass of: ding
subclass of: Restriction
  on property: has part
  some values from: bottom
subclass of: Class
  complement of: Restriction
    on property: has part
    some values from: lid
subclass of: Restriction
  on property: has ear shape
  some values from: VerticalEars
subclass of: Restriction
  on property: has part
  some values from: ears
subclass of: Restriction
  on property: has belly wall
  some values from: bulging belly
subclass of: Class
  complement of: Restriction
    on property: has part
    some values from: single handle
subclass of: Class
  complement of: Restriction
    on property: has part
    some values from: spout
subclass of: Class
  complement of: Restriction
    on property: has bottom
    some values from: Tri-lobedBottom
subclass of: Class
  complement of: Restriction
    on property: has mouth
    some values from: small mouth
subclass of: Class
  complement of: Restriction
    on property: has mouth
    some values from: StraightLipServingAsTenon
subclass of: Restriction
  on property: has part
  some values from: constricted neck
subclass of: Class
  complement of: Restriction
    on property: has foot
    some values from: slender and spreading legs
subclass of: Restriction
  on property: has part
  some values from: foot
subclass of: Restriction
  on property: has foot number
  some values from: ThreeFoot
subclass of: Class
  complement of: Restriction
    on property: has part
    some values from: Swing-handle
subclass of: Class
  complement of: Restriction
    on property: has part
    some values from: constricted waist
subclass of: Restriction
  on property: has part
  some values from: belly
subclass of: Restriction
  on property: has belly shape
  some values from: round body
subclass of: Restriction
  on property: has foot shape
  some values from: similar conical legs
subclass of: Restriction
  on property: has ear location
  some values from: on the rim
subclass of: Restriction
  on property: has mouth shape
  some values from: circular mouth
subclass of: Class
  complement of: Restriction
    on property: has part
    some values from: door
subclass of: Restriction
  on property: has part
  some values from: slanting shoulder
subclass of: Restriction
  on property: has ear direction
  some values from: Straight
subclass of: Restriction
  on property: has bottom shape
  some values from: bulging bottom
subclass of: Restriction
  on property: has part
  some values from: mouth
concept name: <Ding without lid not straight lip serving as tenon not small mouth circular mouth without door without swing-handle without spout without single handle with ears vertical ears on the rim straight constricted neck slanting shoulder not constricted waist round body bulging belly not tri-lobed bulging bottom three legs similar conical legs not slender and spreading legs>
definition: Ding with circular mouth,straight vertical ears on the rim,constricted neck,slanting shoulder,round body,bulging belly,bulging bottom and three similar conical legs
preferred label: 近锥足罐鼎1 @zh
definition: 鼎带圆形口，竖直立耳在口沿上，束颈，溜肩，圆体，鼓腹，圜底，三近锥足 @zh

Similar Conical-legged Pending with Vertical Ears 1
type: Class
subclass of: ding
subclass of: Restriction
  on property: has ear location
  some values from: on the rim
subclass of: Class
  complement of: Restriction
    on property: has part
    some values from: constricted waist
subclass of: Restriction
  on property: has belly shape
  some values from: round body
subclass of: Class
  complement of: Restriction
    on property: has part
    some values from: lid
subclass of: Restriction
  on property: has part
  some values from: mouth
subclass of: Restriction
  on property: has part
  some values from: foot
subclass of: Class
  complement of: Restriction
    on property: has part
    some values from: door
subclass of: Class
  complement of: Restriction
    on property: has bottom
    some values from: Tri-lobedBottom
subclass of: Restriction
  on property: has foot number
  some values from: ThreeFoot
subclass of: Restriction
  on property: has belly wall
  some values from: bulging belly
subclass of: Restriction
  on property: has foot shape
  some values from: similar conical legs
subclass of: Class
  complement of: Restriction
    on property: has mouth
    some values from: small mouth
subclass of: Restriction
  on property: has ear shape
  some values from: VerticalEars
subclass of: Class
  complement of: Restriction
    on property: has part
    some values from: single handle
subclass of: Restriction
  on property: has part
  some values from: belly
subclass of: Restriction
  on property: has bottom shape
  some values from: bulging bottom
subclass of: Restriction
  on property: has mouth shape
  some values from: circular mouth
subclass of: Restriction
  on property: has part
  some values from: bottom
subclass of: Class
  complement of: Restriction
    on property: has part
    some values from: Swing-handle
subclass of: Class
  complement of: Restriction
    on property: has part
    some values from: spout
subclass of: Class
  complement of: Restriction
    on property: has foot
    some values from: slender and spreading legs
subclass of: Restriction
  on property: has part
  some values from: VerticalEars
subclass of: Restriction
  on property: has ear direction
  some values from: Straight
subclass of: Class
  complement of: Restriction
    on property: has part
    some values from: slanting shoulder
subclass of: Class
  complement of: Restriction
    on property: has mouth
    some values from: StraightLipServingAsTenon
subclass of: Class
  complement of: Restriction
    on property: has part
    some values from: constricted neck
concept name: <Ding without lid not straight lip serving as tenon not small mouth circular mouth without door without swing-handle without spout without single handle with ears vertical ears on the rim straight not constricted neck not slanting shoulder not constricted waist round body bulging belly not tri-lobed bulging bottom three legs similar conical legs not slender and spreading legs>
definition: Ding with circular mouth,straight vertical ears on the rim,round body,bulging belly,bulging bottom and three similar conical legs
preferred label: 立耳近锥足盆鼎1 @zh
definition: 鼎带圆形口，竖直立耳在口沿上，圆体，鼓腹，圜底，三近锥足 @zh

similar conical legs
type: Class
subclass of: foot shape
disjoint with: similar hoof-shaped legs
disjoint with: Trisquare-shapedLegs
preferred label: 近锥足 @zh

Similar Hoof-shaped Leg Guanding 1
type: Class
subclass of: ding
subclass of: Restriction
  on property: has ear location
  some values from: UnderTheRim
subclass of: Class
  complement of: Restriction
    on property: has part
    some values from: door
subclass of: Restriction
  on property: has ear direction
  some values from: Straight
subclass of: Restriction
  on property: has part
  some values from: constricted neck
subclass of: Class
  complement of: Restriction
    on property: has part
    some values from: lid
subclass of: Class
  complement of: Restriction
    on property: has mouth
    some values from: small mouth
subclass of: Class
  complement of: Restriction
    on property: has foot
    some values from: slender and spreading legs
subclass of: Restriction
  on property: has part
  some values from: mouth
subclass of: Restriction
  on property: has bottom shape
  some values from: bulging bottom
subclass of: Class
  complement of: Restriction
    on property: has part
    some values from: slanting shoulder
subclass of: Class
  complement of: Restriction
    on property: has mouth
    some values from: StraightLipServingAsTenon
subclass of: Class
  complement of: Restriction
    on property: has part
    some values from: constricted waist
subclass of: Restriction
  on property: has part
  some values from: bottom
subclass of: Restriction
  on property: has mouth shape
  some values from: circular mouth
subclass of: Class
  complement of: Restriction
    on property: has part
    some values from: single handle
subclass of: Restriction
  on property: has part
  some values from: belly
subclass of: Restriction
  on property: has part
  some values from: ears
subclass of: Restriction
  on property: has ear shape
  some values from: side ears
subclass of: Restriction
  on property: has belly shape
  some values from: round body
subclass of: Restriction
  on property: has foot shape
  some values from: similar hoof-shaped legs
subclass of: Class
  complement of: Restriction
    on property: has part
    some values from: Swing-handle
subclass of: Class
  complement of: Restriction
    on property: has bottom
    some values from: Tri-lobedBottom
subclass of: Restriction
  on property: has belly wall
  some values from: bulging belly
subclass of: Restriction
  on property: has part
  some values from: foot
subclass of: Class
  complement of: Restriction
    on property: has part
    some values from: spout
subclass of: Restriction
  on property: has foot number
  some values from: ThreeFoot
concept name: <Ding without lid not straight lip serving as tenon not small mouth circular mouth without door without swing-handle without spout without single handle with ears side ears under the rim straight constricted neck not slanting shoulder not constricted waist round body bulging belly not tri-lobed bulging bottom three legs similar hoof-shaped legs not slender and spreading legs>
definition: Ding with circular mouth,straight side ears under the rim,constricted neck,round body,bulging belly,bulging bottom and three similar hoof-shaped legs
preferred label: 近蹄足罐鼎1 @zh
definition: 鼎带圆形口，竖直附耳在口沿下，束颈，圆体，鼓腹，圜底，三近蹄足 @zh

Similar Hoof-shaped Leg Guanding 2
type: Class
subclass of: ding
subclass of: Class
  complement of: Restriction
    on property: has foot
    some values from: slender and spreading legs
subclass of: Class
  complement of: Restriction
    on property: has part
    some values from: door
subclass of: Class
  complement of: Restriction
    on property: has bottom
    some values from: Tri-lobedBottom
subclass of: Restriction
  on property: has part
  some values from: ears
subclass of: Restriction
  on property: has foot number
  some values from: ThreeFoot
subclass of: Restriction
  on property: has ear shape
  some values from: VerticalEars
subclass of: Restriction
  on property: has belly wall
  some values from: sagging belly
subclass of: Restriction
  on property: has belly shape
  some values from: round body
subclass of: Class
  complement of: Restriction
    on property: has part
    some values from: slanting shoulder
subclass of: Restriction
  on property: has part
  some values from: bottom
subclass of: Class
  complement of: Restriction
    on property: has part
    some values from: spout
subclass of: Class
  complement of: Restriction
    on property: has mouth
    some values from: StraightLipServingAsTenon
subclass of: Restriction
  on property: has foot shape
  some values from: similar hoof-shaped legs
subclass of: Restriction
  on property: has ear direction
  some values from: Straight
subclass of: Restriction
  on property: has ear location
  some values from: on the rim
subclass of: Class
  complement of: Restriction
    on property: has part
    some values from: constricted waist
subclass of: Class
  complement of: Restriction
    on property: has part
    some values from: single handle
subclass of: Restriction
  on property: has part
  some values from: belly
subclass of: Restriction
  on property: has part
  some values from: constricted neck
subclass of: Restriction
  on property: has mouth shape
  some values from: circular mouth
subclass of: Restriction
  on property: has part
  some values from: mouth
subclass of: Class
  complement of: Restriction
    on property: has mouth
    some values from: small mouth
subclass of: Class
  complement of: Restriction
    on property: has part
    some values from: Swing-handle
subclass of: Restriction
  on property: has bottom shape
  some values from: bulging bottom
subclass of: Class
  complement of: Restriction
    on property: has part
    some values from: lid
concept name: <Ding without lid not straight lip serving as tenon not small mouth circular mouth without door without swing-handle without spout without single handle with ears vertical ears on the rim straight constricted neck not slanting shoulder not constricted waist round body sagging belly not tri-lobed slightly bulging bottom three legs similar hoof-shaped legs not slender and spreading legs>
definition: Ding with circular mouth,straight vertical ears on the rim,constricted neck,round body,sagging belly,slightly bulging bottom and three similar hoof-shaped legs
preferred label: 近蹄足罐鼎2 @zh
definition: 鼎带圆形口，竖直立耳在口沿上，束颈，圆体，垂腹，近平底，三近蹄足 @zh

Similar Hoof-shaped Leg Guanding 3
type: Class
subclass of: ding
subclass of: Restriction
  on property: has part
  some values from: constricted neck
subclass of: Class
  complement of: Restriction
    on property: has part
    some values from: Swing-handle
subclass of: Class
  complement of: Restriction
    on property: has part
    some values from: constricted waist
subclass of: Class
  complement of: Restriction
    on property: has mouth
    some values from: small mouth
subclass of: Restriction
  on property: has ear location
  some values from: on the rim
subclass of: Restriction
  on property: has part
  some values from: mouth
subclass of: Class
  complement of: Restriction
    on property: has mouth
    some values from: StraightLipServingAsTenon
subclass of: Restriction
  on property: has part
  some values from: belly
subclass of: Restriction
  on property: has part
  some values from: bottom
subclass of: Class
  complement of: Restriction
    on property: has part
    some values from: door
subclass of: Class
  complement of: Restriction
    on property: has part
    some values from: spout
subclass of: Restriction
  on property: has foot shape
  some values from: hoof-shaped legs
subclass of: Class
  complement of: Restriction
    on property: has foot
    some values from: slender and spreading legs
subclass of: Restriction
  on property: has belly wall
  some values from: sagging belly
subclass of: Restriction
  on property: has part
  some values from: ears
subclass of: Class
  complement of: Restriction
    on property: has part
    some values from: single handle
subclass of: Class
  complement of: Restriction
    on property: has part
    some values from: lid
subclass of: Restriction
  on property: has ear shape
  some values from: VerticalEars
subclass of: Restriction
  on property: has bottom shape
  some values from: bulging bottom
subclass of: Restriction
  on property: has ear direction
  some values from: Straight
subclass of: Class
  complement of: Restriction
    on property: has bottom
    some values from: Tri-lobedBottom
subclass of: Restriction
  on property: has foot number
  some values from: ThreeFoot
subclass of: Restriction
  on property: has part
  some values from: foot
subclass of: Class
  complement of: Restriction
    on property: has part
    some values from: slanting shoulder
subclass of: Restriction
  on property: has mouth shape
  some values from: circular mouth
subclass of: Restriction
  on property: has belly shape
  some values from: round body
concept name: <Ding without lid not straight lip serving as tenon not small mouth circular mouth without door without swing-handle without spout without single handle with ears vertical ears on the rim straight constricted neck not slanting shoulder not constricted waist round body sagging belly not tri-lobed bulging bottom three legs similar hoof-shaped legs not slender and spreading legs>
definition: Ding with circular mouth,straight vertical ears on the rim,constricted neck,round body,sagging belly,bulging bottom and three similar hoof-shaped legs
preferred label: 近蹄足罐鼎3 @zh
definition: 鼎带圆形口，竖直立耳在口沿上，束颈，圆体，垂腹，圜底，三近蹄足 @zh

Similar Hoof-shaped Leg Pending with Side Ears 1
type: Class
subclass of: ding
subclass of: Class
  complement of: Restriction
    on property: has bottom
    some values from: Tri-lobedBottom
subclass of: Restriction
  on property: has ear shape
  some values from: side ears
subclass of: Class
  complement of: Restriction
    on property: has part
    some values from: spout
subclass of: Class
  complement of: Restriction
    on property: has mouth
    some values from: small mouth
subclass of: Restriction
  on property: has part
  some values from: belly
subclass of: Class
  complement of: Restriction
    on property: has part
    some values from: door
subclass of: Class
  complement of: Restriction
    on property: has part
    some values from: constricted waist
subclass of: Restriction
  on property: has part
  some values from: ears
subclass of: Class
  complement of: Restriction
    on property: has part
    some values from: constricted neck
subclass of: Class
  complement of: Restriction
    on property: has part
    some values from: slanting shoulder
subclass of: Restriction
  on property: has mouth shape
  some values from: circular mouth
subclass of: Class
  complement of: Restriction
    on property: has foot
    some values from: slender and spreading legs
subclass of: Restriction
  on property: has part
  some values from: mouth
subclass of: Restriction
  on property: has foot shape
  some values from: similar hoof-shaped legs
subclass of: Restriction
  on property: has ear location
  some values from: UnderTheRim
subclass of: Class
  complement of: Restriction
    on property: has part
    some values from: single handle
subclass of: Restriction
  on property: has foot number
  some values from: ThreeFoot
subclass of: Class
  complement of: Restriction
    on property: has mouth
    some values from: StraightLipServingAsTenon
subclass of: Restriction
  on property: has part
  some values from: foot
subclass of: Restriction
  on property: has belly shape
  some values from: round body
subclass of: Class
  complement of: Restriction
    on property: has part
    some values from: Swing-handle
subclass of: Restriction
  on property: has belly wall
  some values from: bulging belly
subclass of: Restriction
  on property: has part
  some values from: bottom
subclass of: Restriction
  on property: has bottom shape
  some values from: bulging bottom
subclass of: Restriction
  on property: has top shape
  some values from: flat lid
subclass of: Restriction
  on property: has part
  some values from: lid
subclass of: Restriction
  on property: has ear direction
  some values from: Straight
concept name: <Ding with lid flat lid not straight lip serving as tenon not small mouth circular mouth without door without swing-handle without spout without single handle with ears side ears under the rim straight not constricted neck not slanting shoulder not constricted waist round body bulging belly not tri-lobed bulging bottom three legs similar hoof-shaped legs not slender and spreading legs >
definition: Ding with flat lid,circular mouth,straight side ears under the rim,round body,bulging belly,bulging bottom and three similar hoof-shaped legs
preferred label: 附耳近蹄足盆鼎1 @zh
definition: 鼎带盖，平顶，圆形口，竖直附耳在口沿下，圆体，鼓腹，圜底，三近蹄足 @zh

Similar Hoof-shaped Leg Pending with Side Ears 2
type: Class
subclass of: ding
subclass of: Class
  complement of: Restriction
    on property: has part
    some values from: spout
subclass of: Class
  complement of: Restriction
    on property: has bottom
    some values from: Tri-lobedBottom
subclass of: Class
  complement of: Restriction
    on property: has mouth
    some values from: small mouth
subclass of: Class
  complement of: Restriction
    on property: has mouth
    some values from: StraightLipServingAsTenon
subclass of: Restriction
  on property: has part
  some values from: ears
subclass of: Restriction
  on property: has ear direction
  some values from: Straight
subclass of: Restriction
  on property: has part
  some values from: mouth
subclass of: Restriction
  on property: has part
  some values from: bottom
subclass of: Class
  complement of: Restriction
    on property: has part
    some values from: single handle
subclass of: Restriction
  on property: has part
  some values from: foot
subclass of: Restriction
  on property: has bottom shape
  some values from: bulging bottom
subclass of: Class
  complement of: Restriction
    on property: has part
    some values from: lid
subclass of: Class
  complement of: Restriction
    on property: has part
    some values from: slanting shoulder
subclass of: Restriction
  on property: has ear shape
  some values from: side ears
subclass of: Restriction
  on property: has ear location
  some values from: UnderTheRim
subclass of: Restriction
  on property: has belly shape
  some values from: round body
subclass of: Class
  complement of: Restriction
    on property: has foot
    some values from: slender and spreading legs
subclass of: Restriction
  on property: has belly wall
  some values from: sagging belly
subclass of: Restriction
  on property: has foot shape
  some values from: similar hoof-shaped legs
subclass of: Restriction
  on property: has part
  some values from: belly
subclass of: Restriction
  on property: has mouth shape
  some values from: circular mouth
subclass of: Restriction
  on property: has foot number
  some values from: ThreeFoot
subclass of: Class
  complement of: Restriction
    on property: has part
    some values from: Swing-handle
subclass of: Class
  complement of: Restriction
    on property: has part
    some values from: constricted waist
subclass of: Class
  complement of: Restriction
    on property: has part
    some values from: constricted neck
subclass of: Class
  complement of: Restriction
    on property: has part
    some values from: door
concept name: <Ding without lid not straight lip serving as tenon not small mouth circular mouth without door without swing-handle without spout without single handle with ears side ears under the rim straight not constricted neck not slanting shoulder not constricted waist round body sagging belly not tri-lobed bulging bottom three legs similar hoof-shaped legs not slender and spreading legs>
definition: Ding with circular mouth,straight side ears under the rim,round body,sagging belly,bulging bottom and three similar hoof-shaped legs
preferred label: 附耳近蹄足盆鼎2 @zh
definition: 鼎带圆形口，竖直附耳在口沿下，圆体，垂腹，圜底，三近蹄足 @zh

Similar Hoof-shaped Leg Pending with Vertical Ears 2
type: Class
subclass of: ding
subclass of: Restriction
  on property: has part
  some values from: foot
subclass of: Class
  complement of: Restriction
    on property: has part
    some values from: slanting shoulder
subclass of: Restriction
  on property: has mouth
  some values from: mouth
subclass of: Restriction
  on property: has belly shape
  some values from: round body
subclass of: Restriction
  on property: has ear location
  some values from: on the rim
subclass of: Restriction
  on property: has foot number
  some values from: ThreeFoot
subclass of: Restriction
  on property: has part
  some values from: ears
subclass of: Restriction
  on property: has part
  some values from: bottom
subclass of: Class
  complement of: Restriction
    on property: has part
    some values from: door
subclass of: Restriction
  on property: has foot shape
  some values from: similar hoof-shaped legs
subclass of: Restriction
  on property: has part
  some values from: belly
subclass of: Restriction
  on property: has belly wall
  some values from: bulging belly tapering downwards
subclass of: Restriction
  on property: has ear direction
  some values from: Straight
subclass of: Class
  complement of: Restriction
    on property: has mouth
    some values from: StraightLipServingAsTenon
subclass of: Class
  complement of: Restriction
    on property: has part
    some values from: lid
subclass of: Class
  complement of: Restriction
    on property: has part
    some values from: constricted waist
subclass of: Restriction
  on property: has mouth shape
  some values from: circular mouth
subclass of: Restriction
  on property: has bottom shape
  some values from: bulging bottom
subclass of: Restriction
  on property: has ear shape
  some values from: VerticalEars
subclass of: Class
  complement of: Restriction
    on property: has bottom
    some values from: Tri-lobedBottom
subclass of: Class
  complement of: Restriction
    on property: has foot
    some values from: slender and spreading legs
subclass of: Class
  complement of: Restriction
    on property: has part
    some values from: spout
subclass of: Class
  complement of: Restriction
    on property: has part
    some values from: single handle
subclass of: Class
  complement of: Restriction
    on property: has mouth
    some values from: small mouth
subclass of: Class
  complement of: Restriction
    on property: has part
    some values from: Swing-handle
subclass of: Class
  complement of: Restriction
    on property: has part
    some values from: constricted neck
concept name: <Ding without lid not straight lip serving as tenon not small mouth circular mouth without door without swing-handle without spout without single handle with ears vertical ears on the rim straight not constricted neck not slanting shoulder not constricted waist round body bulging belly tapering downwards not tri-lobed bulging bottom three legs similar hoof-shaped legs not slender and spreading legs>
definition: Ding with circular mouth,straight vertical ears on the rim,round body,bulging belly tapering downwards,bulging bottom and three similar hoof-shaped legs
preferred label: 立耳近蹄足盆鼎2 @zh
definition: 鼎带圆形口，竖直立耳在口沿上，圆体，敛腹，圜底，三近蹄足 @zh

Similar Hoof-shaped Leg Pending with Vertical Ears 3
type: Class
subclass of: ding
subclass of: Restriction
  on property: has top shape
  some values from: flat lid
subclass of: Restriction
  on property: has foot shape
  some values from: similar hoof-shaped legs
subclass of: Class
  complement of: Restriction
    on property: has part
    some values from: spout
subclass of: Class
  complement of: Restriction
    on property: has mouth
    some values from: small mouth
subclass of: Restriction
  on property: has part
  some values from: mouth
subclass of: Restriction
  on property: has belly wall
  some values from: sagging belly
subclass of: Restriction
  on property: has ear location
  some values from: on the rim
subclass of: Restriction
  on property: has part
  some values from: ears
subclass of: Restriction
  on property: has ear direction
  some values from: Straight
subclass of: Class
  complement of: Restriction
    on property: has part
    some values from: single handle
subclass of: Restriction
  on property: has mouth shape
  some values from: circular mouth
subclass of: Restriction
  on property: has part
  some values from: bottom
subclass of: Restriction
  on property: has ear shape
  some values from: VerticalEars
subclass of: Restriction
  on property: has belly shape
  some values from: round body
subclass of: Class
  complement of: Restriction
    on property: has part
    some values from: slanting shoulder
subclass of: Class
  complement of: Restriction
    on property: has part
    some values from: Swing-handle
subclass of: Class
  complement of: Restriction
    on property: has part
    some values from: door
subclass of: Restriction
  on property: has bottom shape
  some values from: slightly bulging bottom
subclass of: Restriction
  on property: has foot number
  some values from: ThreeFoot
subclass of: Class
  complement of: Restriction
    on property: has mouth
    some values from: StraightLipServingAsTenon
subclass of: Class
  complement of: Restriction
    on property: has foot
    some values from: slender and spreading legs
subclass of: Class
  complement of: Restriction
    on property: has part
    some values from: constricted waist
subclass of: Restriction
  on property: has part
  some values from: belly
subclass of: Class
  complement of: Restriction
    on property: has bottom
    some values from: Tri-lobedBottom
subclass of: Restriction
  on property: has part
  some values from: lid
subclass of: Restriction
  on property: has part
  some values from: foot
subclass of: Class
  complement of: Restriction
    on property: has part
    some values from: constricted neck
concept name: <Ding with lid flat lid not straight lip serving as tenon not small mouth circular mouth without door without swing-handle without spout without single handle with ears vertical ears on the rim straight not constricted neck not slanting shoulder not constricted waist round body sagging belly not tri-lobed slightly bulging bottom three legs similar hoof-shaped legs not slender and spreading legs>
definition: Ding with flat lid,circular mouth,straight vertical ears on the rim,round body,sagging belly,slightly bulging bottom and three similar hoof-shaped legs
preferred label: 立耳近蹄足盆鼎3 @zh
definition: 鼎带盖，平顶，圆形口，竖直立耳在口沿上，圆体，垂腹，近平底，三近蹄足 @zh

Similar Hoof-shaped Leg Pending with Vertical Ears 4
type: Class
subclass of: ding
subclass of: Class
  complement of: Restriction
    on property: has part
    some values from: constricted waist
subclass of: Restriction
  on property: has ear location
  some values from: on the rim
subclass of: Class
  complement of: Restriction
    on property: has part
    some values from: lid
subclass of: Class
  complement of: Restriction
    on property: has part
    some values from: constricted neck
subclass of: Class
  complement of: Restriction
    on property: has mouth
    some values from: StraightLipServingAsTenon
subclass of: Class
  complement of: Restriction
    on property: has bottom
    some values from: Tri-lobedBottom
subclass of: Restriction
  on property: has part
  some values from: foot
subclass of: Restriction
  on property: has part
  some values from: belly
subclass of: Restriction
  on property: has ear shape
  some values from: VerticalEars
subclass of: Class
  complement of: Restriction
    on property: has part
    some values from: spout
subclass of: Class
  complement of: Restriction
    on property: has part
    some values from: slanting shoulder
subclass of: Restriction
  on property: has part
  some values from: ears
subclass of: Class
  complement of: Restriction
    on property: has part
    some values from: Swing-handle
subclass of: Restriction
  on property: has belly wall
  some values from: sagging belly
subclass of: Restriction
  on property: has ear direction
  some values from: Straight
subclass of: Restriction
  on property: has mouth shape
  some values from: circular mouth
subclass of: Restriction
  on property: has part
  some values from: bottom
subclass of: Restriction
  on property: has bottom shape
  some values from: bulging bottom
subclass of: Restriction
  on property: has foot shape
  some values from: similar hoof-shaped legs
subclass of: Class
  complement of: Restriction
    on property: has part
    some values from: single handle
subclass of: Class
  complement of: Restriction
    on property: has foot
    some values from: slender and spreading legs
subclass of: Class
  complement of: Restriction
    on property: has mouth
    some values from: small mouth
subclass of: Restriction
  on property: has part
  some values from: mouth
subclass of: Restriction
  on property: has belly shape
  some values from: round body
subclass of: Restriction
  on property: has foot number
  some values from: ThreeFoot
subclass of: Class
  complement of: Restriction
    on property: has part
    some values from: door
concept name: <Ding without lid not straight lip serving as tenon not small mouth circular mouth without door without swing-handle without spout without single handle with ears vertical ears on the rim straight not constricted neck not slanting shoulder not constricted waist round body sagging belly not tri-lobed bulging bottom three legs similar hoof-shaped legs not slender and spreading legs>
definition: Ding with circular mouth,straight vertical ears on the rim,round body,sagging belly,bulging bottom and three similar hoof-shaped legs
preferred label: 立耳近蹄足盆鼎4 @zh
definition: 鼎带圆形口，竖直立耳在口沿上，圆体，垂腹，圜底，三近蹄足 @zh

Similar Hoof-shaped Leg Pending with Vertical Ears 5
type: Class
subclass of: ding
subclass of: Class
  complement of: Restriction
    on property: has part
    some values from: lid
subclass of: Restriction
  on property: has part
  some values from: mouth
subclass of: Class
  complement of: Restriction
    on property: has part
    some values from: slanting shoulder
subclass of: Class
  complement of: Restriction
    on property: has part
    some values from: Swing-handle
subclass of: Class
  complement of: Restriction
    on property: has part
    some values from: constricted waist
subclass of: Restriction
  on property: has belly shape
  some values from: round body
subclass of: Class
  complement of: Restriction
    on property: has mouth
    some values from: small mouth
subclass of: Class
  complement of: Restriction
    on property: has mouth
    some values from: StraightLipServingAsTenon
subclass of: Restriction
  on property: has part
  some values from: ears
subclass of: Restriction
  on property: has foot number
  some values from: ThreeFoot
subclass of: Restriction
  on property: has part
  some values from: foot
subclass of: Restriction
  on property: has foot shape
  some values from: similar hoof-shaped legs
subclass of: Restriction
  on property: has ear shape
  some values from: VerticalEars
subclass of: Restriction
  on property: has part
  some values from: bottom
subclass of: Class
  complement of: Restriction
    on property: has part
    some values from: single handle
subclass of: Restriction
  on property: has ear location
  some values from: on the rim
subclass of: Class
  complement of: Restriction
    on property: has part
    some values from: door
subclass of: Restriction
  on property: has bottom shape
  some values from: bulging bottom
subclass of: Class
  complement of: Restriction
    on property: has part
    some values from: spout
subclass of: Class
  complement of: Restriction
    on property: has foot
    some values from: slender and spreading legs
subclass of: Restriction
  on property: has ear direction
  some values from: Straight
subclass of: Restriction
  on property: has part
  some values from: belly
subclass of: Class
  complement of: Restriction
    on property: has part
    some values from: constricted neck
subclass of: Restriction
  on property: has mouth shape
  some values from: circular mouth
subclass of: Restriction
  on property: has belly wall
  some values from: bulging belly
subclass of: Class
  complement of: Restriction
    on property: has bottom
    some values from: Tri-lobedBottom
concept name: <Ding without lid not straight lip serving as tenon not small mouth circular mouth without door without swing-handle without spout without single handle with ears vertical ears on the rim straight not constricted neck not slanting shoulder not constricted waist round body bulging belly not tri-lobed bulging bottom three legs similar hoof-shaped legs not slender and spreading legs>
definition: Ding with circular mouth,straight vertical ears on the rim,round body,bulging belly,bulging bottom and three similar hoof-shaped legs
preferred label: 立耳近蹄足盆鼎5 @zh
definition: 鼎带圆形口，竖直立耳在口沿上，圆体，鼓腹，圜底，三近蹄足 @zh

Similar Hoof-shaped Leg Pending with Vertical Ears 6
type: Class
subclass of: ding
subclass of: Class
  complement of: Restriction
    on property: has foot
    some values from: slender and spreading legs
subclass of: Restriction
  on property: has foot number
  some values from: ThreeFoot
subclass of: Class
  complement of: Restriction
    on property: has part
    some values from: Swing-handle
subclass of: Restriction
  on property: has part
  some values from: bottom
subclass of: Class
  complement of: Restriction
    on property: has part
    some values from: lid
subclass of: Class
  complement of: Restriction
    on property: has part
    some values from: constricted waist
subclass of: Class
  complement of: Restriction
    on property: has mouth
    some values from: StraightLipServingAsTenon
subclass of: Restriction
  on property: has mouth shape
  some values from: circular mouth
subclass of: Restriction
  on property: has part
  some values from: ears
subclass of: Restriction
  on property: has ear shape
  some values from: VerticalEars
subclass of: Class
  complement of: Restriction
    on property: has mouth
    some values from: small mouth
subclass of: Restriction
  on property: has belly shape
  some values from: round body
subclass of: Class
  complement of: Restriction
    on property: has bottom
    some values from: Tri-lobedBottom
subclass of: Class
  complement of: Restriction
    on property: has part
    some values from: single handle
subclass of: Restriction
  on property: has foot shape
  some values from: similar hoof-shaped legs
subclass of: Class
  complement of: Restriction
    on property: has part
    some values from: spout
subclass of: Restriction
  on property: has belly wall
  some values from: sagging belly
subclass of: Class
  complement of: Restriction
    on property: has part
    some values from: slanting shoulder
subclass of: Restriction
  on property: has ear location
  some values from: on the rim
subclass of: Class
  complement of: Restriction
    on property: has part
    some values from: constricted neck
subclass of: Class
  complement of: Restriction
    on property: has part
    some values from: door
subclass of: Restriction
  on property: has part
  some values from: belly
subclass of: Restriction
  on property: has bottom shape
  some values from: slightly bulging bottom
subclass of: Restriction
  on property: has part
  some values from: foot
subclass of: Restriction
  on property: has ear direction
  some values from: Straight
subclass of: Restriction
  on property: has part
  some values from: mouth
concept name: <Ding without lid not straight lip serving as tenon not small mouth circular mouth without door without swing-handle without spout without single handle with ears vertical ears on the rim straight not constricted neck not slanting shoulder not constricted waist round body sagging belly not tri-lobed slightly bulging bottom three legs similar hoof-shaped legs not slender and spreading legs>
definition: Ding with circular mouth,straight vertical ears on the rim,round body,sagging belly,slightly bulging bottom and three similar hoof-shaped legs
preferred label: 立耳近蹄足盆鼎6 @zh
definition: 鼎带圆形口，竖直立耳在口沿上，圆体，垂腹，近平底，三近蹄足 @zh

Similar Hoof-shaped Leg Pending with Vertical Ears 7
type: Class
subclass of: ding
subclass of: Class
  complement of: Restriction
    on property: has part
    some values from: door
subclass of: Restriction
  on property: has part
  some values from: ears
subclass of: Class
  complement of: Restriction
    on property: has part
    some values from: lid
subclass of: Restriction
  on property: has belly shape
  some values from: round body
subclass of: Restriction
  on property: has belly wall
  some values from: StraightBelly
subclass of: Class
  complement of: Restriction
    on property: has part
    some values from: single handle
subclass of: Class
  complement of: Restriction
    on property: has part
    some values from: spout
subclass of: Class
  complement of: Restriction
    on property: has mouth
    some values from: StraightLipServingAsTenon
subclass of: Restriction
  on property: has part
  some values from: mouth
subclass of: Class
  complement of: Restriction
    on property: has part
    some values from: slanting shoulder
subclass of: Restriction
  on property: has part
  some values from: belly
subclass of: Class
  complement of: Restriction
    on property: has bottom
    some values from: Tri-lobedBottom
subclass of: Class
  complement of: Restriction
    on property: has part
    some values from: constricted waist
subclass of: Restriction
  on property: has foot number
  some values from: ThreeFoot
subclass of: Restriction
  on property: has foot shape
  some values from: similar hoof-shaped legs
subclass of: Restriction
  on property: has ear location
  some values from: on the rim
subclass of: Restriction
  on property: has mouth shape
  some values from: circular mouth
subclass of: Class
  complement of: Restriction
    on property: has mouth
    some values from: small mouth
subclass of: Restriction
  on property: has part
  some values from: foot
subclass of: Restriction
  on property: has ear direction
  some values from: Straight
subclass of: Class
  complement of: Restriction
    on property: has part
    some values from: Swing-handle
subclass of: Restriction
  on property: has bottom shape
  some values from: bulging bottom
subclass of: Class
  complement of: Restriction
    on property: has part
    some values from: constricted neck
subclass of: Class
  complement of: Restriction
    on property: has foot
    some values from: slender and spreading legs
subclass of: Restriction
  on property: has ear shape
  some values from: VerticalEars
subclass of: Restriction
  on property: has part
  some values from: bottom
concept name: <Ding without lid not straight lip serving as tenon not small mouth circular mouth without door without swing-handle without spout without single handle with ears vertical ears on the rim straight not constricted neck not slanting shoulder not constricted waist round body straight belly not tri-lobed bulging bottom three legs similar hoof-shaped legs not slender and spreading legs>
definition: Ding with circular mouth,straight vertical ears on the rim,round body,straight belly,bulging bottom and three similar hoof-shaped legs
preferred label: 立耳近蹄足盆鼎7 @zh
definition: 鼎带圆形口，竖直立耳在口沿上，圆体，直腹，圜底，三近蹄足 @zh

Similar Hoof-shaped Leg Pending with Vertical Ears 1
type: Class
subclass of: ding
subclass of: Class
  complement of: Restriction
    on property: has part
    some values from: single handle
subclass of: Restriction
  on property: has part
  some values from: ears
subclass of: Restriction
  on property: has mouth shape
  some values from: circular mouth
subclass of: Class
  complement of: Restriction
    on property: has bottom
    some values from: Tri-lobedBottom
subclass of: Restriction
  on property: has top shape
  some values from: domed lid
subclass of: Class
  complement of: Restriction
    on property: has part
    some values from: constricted neck
subclass of: Class
  complement of: Restriction
    on property: has part
    some values from: spout
subclass of: Restriction
  on property: has part
  some values from: lid
subclass of: Restriction
  on property: has ear direction
  some values from: Straight
subclass of: Class
  complement of: Restriction
    on property: has mouth
    some values from: small mouth
subclass of: Restriction
  on property: has belly shape
  some values from: round body
subclass of: Class
  complement of: Restriction
    on property: has part
    some values from: door
subclass of: Class
  complement of: Restriction
    on property: has part
    some values from: Swing-handle
subclass of: Class
  complement of: Restriction
    on property: has mouth
    some values from: StraightLipServingAsTenon
subclass of: Class
  complement of: Restriction
    on property: has foot
    some values from: slender and spreading legs
subclass of: Restriction
  on property: has belly wall
  some values from: bulging belly
subclass of: Class
  complement of: Restriction
    on property: has part
    some values from: slanting shoulder
subclass of: Restriction
  on property: has foot shape
  some values from: similar hoof-shaped legs
subclass of: Restriction
  on property: has ear location
  some values from: on the rim
subclass of: Restriction
  on property: has foot number
  some values from: ThreeFoot
subclass of: Restriction
  on property: has ear shape
  some values from: VerticalEars
subclass of: Restriction
  on property: has part
  some values from: foot
subclass of: Class
  complement of: Restriction
    on property: has part
    some values from: constricted waist
concept name: <Ding with lid domed lid not straight lip serving as tenon not small mouth circular mouth without door without swing-handle without spout without single handle with ears vertical ears on the rim straight not constricted neck not slanting shoulder not constricted waist round body bulging belly not tri-lobed bulging bottom three legs similar hoof-shaped legs not slender and spreading legs>
definition: Ding with domed lid,circular mouth,straight vertical ears on the rim,round body,bulging belly,bulging bottom and three similar hoof-shaped legs
preferred label: 立耳近蹄足盆鼎1 @zh
definition: 鼎带盖，圜顶，圆形口，竖直立耳在口沿上，圆体，鼓腹，圜底，三近蹄足 @zh

Similar Hoof-shaped Leg Rectangular Ding 1
type: Class
subclass of: ding
subclass of: Restriction
  on property: has part
  some values from: door
subclass of: Restriction
  on property: has belly shape
  some values from: rectangular body
subclass of: Class
  complement of: Restriction
    on property: has part
    some values from: constricted neck
subclass of: Class
  complement of: Restriction
    on property: has part
    some values from: lid
subclass of: Class
  complement of: Restriction
    on property: has mouth
    some values from: StraightLipServingAsTenon
subclass of: Restriction
  on property: has part
  some values from: ears
subclass of: Restriction
  on property: has ear direction
  some values from: Straight
subclass of: Class
  complement of: Restriction
    on property: has part
    some values from: single handle
subclass of: Restriction
  on property: has part
  some values from: bottom
subclass of: Class
  complement of: Restriction
    on property: has part
    some values from: slanting shoulder
subclass of: Class
  complement of: Restriction
    on property: has bottom
    some values from: Tri-lobedBottom
subclass of: Restriction
  on property: has ear location
  some values from: on the rim
subclass of: Restriction
  on property: has part
  some values from: belly
subclass of: Restriction
  on property: has foot number
  some values from: four foot
subclass of: Class
  complement of: Restriction
    on property: has part
    some values from: Swing-handle
subclass of: Restriction
  on property: has mouth shape
  some values from: SquareMouth
subclass of: Restriction
  on property: has belly wall
  some values from: StraightBelly
subclass of: Restriction
  on property: has part
  some values from: foot
subclass of: Restriction
  on property: has ear shape
  some values from: VerticalEars
subclass of: Class
  complement of: Restriction
    on property: has part
    some values from: spout
subclass of: Restriction
  on property: has foot shape
  some values from: similar hoof-shaped legs
subclass of: Class
  complement of: Restriction
    on property: has mouth
    some values from: small mouth
subclass of: Class
  complement of: Restriction
    on property: has foot
    some values from: slender and spreading legs
subclass of: Restriction
  on property: has part
  some values from: mouth
subclass of: Restriction
  on property: has bottom shape
  some values from: flat bottom
subclass of: Class
  complement of: Restriction
    on property: has part
    some values from: constricted waist
concept name: <Ding without lid not straight lip serving as tenon not small mouth square mouth with door without swing-handle without spout without single handle with ears vertical ears on the rim straight not constricted neck not slanting shoulder not constricted waist rectangular body straight belly not tri-lobed flat bottom four legs similar hoof-shaped legs not slender and spreading legs>
definition: Ding with square mouth,door,straight vertical ears on the rim,rectangular body,straight belly,flat bottom and four similar hoof-shaped legs
alternative label: Similar Hoof-shaped Leg Fangding 1
preferred label: 近蹄足方鼎1 @zh
definition: 鼎带正方形口，带门，竖直立耳在口沿上，长方体，直腹，平底，四近蹄足 @zh

Similar Hoof-shaped Leg Rectangular Ding 2
type: Class
subclass of: ding
subclass of: Class
  complement of: Restriction
    on property: has foot
    some values from: slender and spreading legs
subclass of: Class
  complement of: Restriction
    on property: has part
    some values from: door
subclass of: Class
  complement of: Restriction
    on property: has mouth
    some values from: StraightLipServingAsTenon
subclass of: Class
  complement of: Restriction
    on property: has part
    some values from: slanting shoulder
subclass of: Restriction
  on property: has ear location
  some values from: on the rim
subclass of: Restriction
  on property: has part
  some values from: ears
subclass of: Restriction
  on property: has part
  some values from: foot
subclass of: Class
  complement of: Restriction
    on property: has part
    some values from: single handle
subclass of: Restriction
  on property: has part
  some values from: belly
subclass of: Restriction
  on property: has part
  some values from: mouth
subclass of: Class
  complement of: Restriction
    on property: has bottom
    some values from: Tri-lobedBottom
subclass of: Restriction
  on property: has belly wall
  some values from: StraightBelly
subclass of: Restriction
  on property: has ear shape
  some values from: VerticalEars
subclass of: Restriction
  on property: has foot shape
  some values from: similar hoof-shaped legs
subclass of: Class
  complement of: Restriction
    on property: has part
    some values from: constricted waist
subclass of: Class
  complement of: Restriction
    on property: has mouth
    some values from: small mouth
subclass of: Class
  complement of: Restriction
    on property: has part
    some values from: constricted neck
subclass of: Class
  complement of: Restriction
    on property: has part
    some values from: Swing-handle
subclass of: Restriction
  on property: has ear direction
  some values from: Straight
subclass of: Restriction
  on property: has bottom shape
  some values from: flat bottom
subclass of: Restriction
  on property: has belly shape
  some values from: rectangular body
subclass of: Restriction
  on property: has mouth shape
  some values from: rectangular mouth
subclass of: Class
  complement of: Restriction
    on property: has part
    some values from: spout
subclass of: Restriction
  on property: has foot number
  some values from: four foot
subclass of: Restriction
  on property: has part
  some values from: bottom
subclass of: Class
  complement of: Restriction
    on property: has part
    some values from: lid
concept name: <Ding without lid not straight lip serving as tenon not small mouth rectangular mouth without door without swing-handle without spout without single handle with ears vertical ears on the rim straight not constricted neck not slanting shoulder not constricted waist rectangular body straight belly not tri-lobed flat bottom four legs similar hoof-shaped legs not slender and spreading legs>
definition: Ding with rectangular mouth,straight vertical ears on the rim,rectangular body,straight belly,flat bottom and four similar hoof-shaped legs
preferred label: 近蹄足方鼎2 @zh
definition: 鼎带长方形口，竖直立耳在口沿上，长方体，直腹，平底，四近蹄足 @zh

Similar Hoof-shaped Leg Fangding 3
type: Class
subclass of: ding
subclass of: Restriction
  on property: has part
  some values from: bottom
subclass of: Class
  complement of: Restriction
    on property: has part
    some values from: spout
subclass of: Class
  complement of: Restriction
    on property: has bottom
    some values from: Tri-lobedBottom
subclass of: Restriction
  on property: has ear direction
  some values from: Straight
subclass of: Class
  complement of: Restriction
    on property: has part
    some values from: constricted neck
subclass of: Class
  complement of: Restriction
    on property: has part
    some values from: door
subclass of: Restriction
  on property: has mouth shape
  some values from: SquareMouth
subclass of: Restriction
  on property: has belly shape
  some values from: rectangular body
subclass of: Restriction
  on property: has belly wall
  some values from: StraightBelly
subclass of: Restriction
  on property: has part
  some values from: belly
subclass of: Class
  complement of: Restriction
    on property: has part
    some values from: lid
subclass of: Class
  complement of: Restriction
    on property: has mouth
    some values from: small mouth
subclass of: Restriction
  on property: has ear location
  some values from: on the rim
subclass of: Restriction
  on property: has foot shape
  some values from: similar hoof-shaped legs
subclass of: Class
  complement of: Restriction
    on property: has part
    some values from: constricted waist
subclass of: Restriction
  on property: has part
  some values from: foot
subclass of: Restriction
  on property: has part
  some values from: ears
subclass of: Class
  complement of: Restriction
    on property: has part
    some values from: single handle
subclass of: Restriction
  on property: has part
  some values from: mouth
subclass of: Restriction
  on property: has ear shape
  some values from: VerticalEars
subclass of: Restriction
  on property: has bottom shape
  some values from: flat bottom
subclass of: Class
  complement of: Restriction
    on property: has foot
    some values from: slender and spreading legs
subclass of: Restriction
  on property: has foot number
  some values from: four foot
subclass of: Class
  complement of: Restriction
    on property: has mouth
    some values from: StraightLipServingAsTenon
subclass of: Class
  complement of: Restriction
    on property: has part
    some values from: slanting shoulder
subclass of: Class
  complement of: Restriction
    on property: has part
    some values from: Swing-handle
concept name: <Ding without lid not straight lip serving as tenon not small mouth square mouth without door without swing-handle without spout without single handle with ears vertical ears on the rim straight not constricted neck not slanting shoulder not constricted waist rectangular body straight belly not tri-lobed flat bottom four legs similar hoof-shaped legs not slender and spreading legs>
definition: Ding with square mouth,straight vertical ears on the rim,rectangular body,straight belly,flat bottom and four similar hoof-shaped legs
preferred label: Similar Hoof-shaped Leg Rectangular Ding 3
preferred label: 近蹄足方鼎3 @zh
definition: 鼎带正方形口，竖直立耳在口沿上，长方体，直腹，平底，四近蹄足 @zh

similar hoof-shaped legs
type: Class
subclass of: foot shape
disjoint with: Trisquare-shapedLegs
preferred label: 近蹄足 @zh

single handle
type: Class
subclass of: part
preferred label: 鋬 @zh

slanting shoulder
type: Class
subclass of: shoulder
preferred label: 溜肩 @zh

slender and spreading legs
type: Class
subclass of: foot
preferred label: 细撇足 @zh

slightly bulging bottom
type: Class
subclass of: bottom shape
preferred label: 近平底 @zh

Small-mouthed Ding 1
type: Class
subclass of: ding
subclass of: Restriction
  on property: has part
  some values from: belly
subclass of: Class
  complement of: Restriction
    on property: has bottom
    some values from: Tri-lobedBottom
subclass of: Restriction
  on property: has mouth
  some values from: small mouth
subclass of: Class
  complement of: Restriction
    on property: has part
    some values from: constricted neck
subclass of: Restriction
  on property: has part
  some values from: ears
subclass of: Restriction
  on property: has ear shape
  some values from: semi-circular ears
subclass of: Class
  complement of: Restriction
    on property: has part
    some values from: spout
subclass of: Restriction
  on property: has bottom shape
  some values from: bulging bottom
subclass of: Class
  complement of: Restriction
    on property: has foot
    some values from: slender and spreading legs
subclass of: Restriction
  on property: has part
  some values from: bottom
subclass of: Restriction
  on property: has ear direction
  some values from: Transverse
subclass of: Restriction
  on property: has mouth shape
  some values from: circular mouth
subclass of: Restriction
  on property: has part
  some values from: slanting shoulder
subclass of: Restriction
  on property: has part
  some values from: foot
subclass of: Restriction
  on property: has foot shape
  some values from: hoof-shaped legs
subclass of: Restriction
  on property: has top shape
  some values from: flat lid
subclass of: Restriction
  on property: has belly shape
  some values from: round body
subclass of: Restriction
  on property: has part
  some values from: lid
subclass of: Restriction
  on property: has foot number
  some values from: ThreeFoot
subclass of: Restriction
  on property: has mouth
  some values from: StraightLipServingAsTenon
subclass of: Class
  complement of: Restriction
    on property: has part
    some values from: door
subclass of: Class
  complement of: Restriction
    on property: has part
    some values from: constricted waist
subclass of: Restriction
  on property: has belly wall
  some values from: bulging belly
subclass of: Restriction
  on property: has ear location
  some values from: attached to the belly
subclass of: Class
  complement of: Restriction
    on property: has part
    some values from: Swing-handle
subclass of: Class
  complement of: Restriction
    on property: has part
    some values from: single handle
concept name: <Ding with lid flat lid straight lip serving as tenon small mouth circular mouth without door without swing-handle without spout without single handle with ears semi-circular ears attached to the belly transverse not constricted neck slanting shoulder not constricted waist round body bulging belly not tri-lobed bulging bottom three legs hoof-shaped legs not slender and spreading legs>
definition: Ding with flat lid,straight lip serving as tenon,small mouth,circular mouth,transverse semi-circular ears attached to the belly,slanting shoulder,round body,bulging belly,bulging bottom and three hoof-shaped legs
alternative label: Tangding 1
preferred label: 小口溜肩鼎1 @zh
alternative label: 汤鼎1 @zh
definition: 鼎带盖，平顶，子母口，小口，圆形口，横向半环耳在腹部，溜肩，圆体，鼓腹，圜底，三蹄足 @zh

Small-mouthed Ding 2
type: Class
subclass of: ding
subclass of: Restriction
  on property: has mouth shape
  some values from: circular mouth
subclass of: Class
  complement of: Restriction
    on property: has part
    some values from: Swing-handle
subclass of: Restriction
  on property: has mouth
  some values from: StraightLipServingAsTenon
subclass of: Restriction
  on property: has part
  some values from: bottom
subclass of: Restriction
  on property: has ear direction
  some values from: Spreading
subclass of: Restriction
  on property: has belly wall
  some values from: bulging belly
subclass of: Restriction
  on property: has part
  some values from: belly
subclass of: Restriction
  on property: has part
  some values from: foot
subclass of: Restriction
  on property: has ear location
  some values from: on the shoulder
subclass of: Class
  complement of: Restriction
    on property: has foot
    some values from: slender and spreading legs
subclass of: Restriction
  on property: has part
  some values from: slanting shoulder
subclass of: Restriction
  on property: has foot shape
  some values from: hoof-shaped legs
subclass of: Restriction
  on property: has part
  some values from: lid
subclass of: Class
  complement of: Restriction
    on property: has part
    some values from: door
subclass of: Restriction
  on property: has top shape
  some values from: flat lid
subclass of: Class
  complement of: Restriction
    on property: has bottom
    some values from: Tri-lobedBottom
subclass of: Restriction
  on property: has foot number
  some values from: ThreeFoot
subclass of: Restriction
  on property: has part
  some values from: ears
subclass of: Class
  complement of: Restriction
    on property: has part
    some values from: spout
subclass of: Restriction
  on property: has mouth
  some values from: small mouth
subclass of: Class
  complement of: Restriction
    on property: has part
    some values from: constricted waist
subclass of: Class
  complement of: Restriction
    on property: has part
    some values from: single handle
subclass of: Class
  complement of: Restriction
    on property: has part
    some values from: constricted neck
subclass of: Restriction
  on property: has belly shape
  some values from: round body
subclass of: Restriction
  on property: has bottom shape
  some values from: bulging bottom
subclass of: Restriction
  on property: has ear shape
  some values from: circular ears
concept name: <Ding with lid flat lid straight lip serving as tenon small mouth circular mouth without door without swing-handle without spout without single handle with ears circular ears on the shoulder spreading not constricted neck slanting shoulder not constricted waist round body bulging belly not tri-lobed bulging bottom three legs hoof-shaped legs not slender and spreading legs>
definition: Ding with flat lid,straight lip serving as tenon,small mouth,circular mouth,spreading circular ears on the shoulder,slanting shoulder,round body,bulging belly,bulging bottom and three hoof-shaped legs
alternative label: Tangding 2
alternative label: 汤鼎2
preferred label: 小口溜肩鼎2 @zh
definition: 鼎带盖，平顶，子母口，小口，圆形口，外撇环耳在肩部，溜肩，圆体，鼓腹，圜底，三蹄足 @zh

Small-mouthed Ding 3
type: Class
subclass of: ding
subclass of: Restriction
  on property: has mouth shape
  some values from: circular mouth
subclass of: Restriction
  on property: has part
  some values from: bottom
subclass of: Restriction
  on property: has ear location
  some values from: on the shoulder
subclass of: Restriction
  on property: has part
  some values from: slanting shoulder
subclass of: Restriction
  on property: has part
  some values from: ears
subclass of: Restriction
  on property: has foot shape
  some values from: hoof-shaped legs
subclass of: Class
  complement of: Restriction
    on property: has bottom
    some values from: Tri-lobedBottom
subclass of: Class
  complement of: Restriction
    on property: has part
    some values from: single handle
subclass of: Class
  complement of: Restriction
    on property: has part
    some values from: spout
subclass of: Restriction
  on property: has part
  some values from: belly
subclass of: Class
  complement of: Restriction
    on property: has part
    some values from: constricted neck
subclass of: Class
  complement of: Restriction
    on property: has part
    some values from: constricted waist
subclass of: Class
  complement of: Restriction
    on property: has foot
    some values from: slender and spreading legs
subclass of: Restriction
  on property: has belly wall
  some values from: bulging belly
subclass of: Restriction
  on property: has mouth
  some values from: StraightLipServingAsTenon
subclass of: Restriction
  on property: has part
  some values from: lid
subclass of: Restriction
  on property: has belly shape
  some values from: round body
subclass of: Restriction
  on property: has ear shape
  some values from: ears with loose rings
subclass of: Class
  complement of: Restriction
    on property: has part
    some values from: door
subclass of: Restriction
  on property: has ear direction
  some values from: Transverse
subclass of: Restriction
  on property: has mouth
  some values from: small mouth
subclass of: Restriction
  on property: has top shape
  some values from: flat lid
subclass of: Restriction
  on property: has foot number
  some values from: ThreeFoot
subclass of: Restriction
  on property: has part
  some values from: foot
subclass of: Class
  complement of: Restriction
    on property: has part
    some values from: Swing-handle
subclass of: Restriction
  on property: has bottom shape
  some values from: bulging bottom
concept name: <Ding with lid flat lid straight lip serving as tenon small mouth circular mouth without door without swing-handle without spout without single handle with ears ears with loose rings on the shoulder transverse not constricted neck slanting shoulder not constricted waist round body bulging belly not tri-lobed bulging bottom three legs hoof-shaped legs not slender and spreading legs>
definition: Ding with flat lid,straight lip serving as tenon,small mouth,circular mouth,transverse ears with loose rings on the shoulder,slanting shoulder,round body,bulging belly,bulging bottom and three hoof-shaped legs
alternative label: Tangding 3
preferred label: 小口溜肩鼎3 @zh
alternative label: 汤鼎3 @zh
definition: 鼎带盖，平顶，子母口，小口，圆形口，横向衔环耳在肩部，溜肩，圆体，鼓腹，圜底，三蹄足 @zh

Small-mouthed Ding 4
type: Class
subclass of: ding
subclass of: Class
  complement of: Restriction
    on property: has part
    some values from: single handle
subclass of: Class
  complement of: Restriction
    on property: has foot
    some values from: slender and spreading legs
subclass of: Restriction
  on property: has top shape
  some values from: flat lid
subclass of: Restriction
  on property: has mouth shape
  some values from: circular mouth
subclass of: Class
  complement of: Restriction
    on property: has part
    some values from: constricted neck
subclass of: Restriction
  on property: has part
  some values from: lid
subclass of: Restriction
  on property: has mouth
  some values from: StraightLipServingAsTenon
subclass of: Class
  complement of: Restriction
    on property: has bottom
    some values from: Tri-lobedBottom
subclass of: Restriction
  on property: has foot number
  some values from: ThreeFoot
subclass of: Restriction
  on property: has ear direction
  some values from: Straight
subclass of: Restriction
  on property: has foot shape
  some values from: hoof-shaped legs
subclass of: Class
  complement of: Restriction
    on property: has part
    some values from: door
subclass of: Restriction
  on property: has part
  some values from: foot
subclass of: Restriction
  on property: has part
  some values from: ears
subclass of: Restriction
  on property: has part
  some values from: belly
subclass of: Restriction
  on property: has ear shape
  some values from: VerticalEars
subclass of: Restriction
  on property: has belly wall
  some values from: bulging belly
subclass of: Restriction
  on property: has mouth
  some values from: small mouth
subclass of: Restriction
  on property: has bottom shape
  some values from: bulging bottom
subclass of: Restriction
  on property: has belly shape
  some values from: round body
subclass of: Restriction
  on property: has part
  some values from: bottom
subclass of: Class
  complement of: Restriction
    on property: has part
    some values from: Swing-handle
subclass of: Class
  complement of: Restriction
    on property: has part
    some values from: spout
subclass of: Restriction
  on property: has part
  some values from: slanting shoulder
subclass of: Class
  complement of: Restriction
    on property: has part
    some values from: constricted waist
subclass of: Restriction
  on property: has ear location
  some values from: on the shoulder
concept name: <Ding with lid flat lid straight lip serving as tenon small mouth circular mouth without door without swing-handle without spout without single handle with ears vertical ears on the shoulder straight not constricted neck slanting shoulder not constricted waist round body bulging belly not tri-lobed bulging bottom three legs hoof-shaped legs not slender and spreading legs>
definition: Ding with flat lid,straight lip serving as tenon,small mouth,circular mouth,straight vertical ears on the shoulder,slanting shoulder,round body,bulging belly,bulging bottom and three hoof-shaped legs
alternative label: Tangding 4
preferred label: 小口溜肩鼎4 @zh
alternative label: 汤鼎4 @zh
definition: 鼎带盖，平顶，子母口，小口 圆形口，竖直立耳在肩部，溜肩，圆体，鼓腹，圜底，三蹄足 @zh

Small-mouthed Ding 5
type: Class
subclass of: ding
subclass of: Class
  complement of: Restriction
    on property: has bottom
    some values from: Tri-lobedBottom
subclass of: Restriction
  on property: has bottom shape
  some values from: bulging bottom
subclass of: Restriction
  on property: has mouth
  some values from: small mouth
subclass of: Restriction
  on property: has ear direction
  some values from: Straight
subclass of: Restriction
  on property: has foot number
  some values from: ThreeFoot
subclass of: Restriction
  on property: has part
  some values from: slanting shoulder
subclass of: Class
  complement of: Restriction
    on property: has part
    some values from: door
subclass of: Class
  complement of: Restriction
    on property: has part
    some values from: spout
subclass of: Restriction
  on property: has ear shape
  some values from: animal-shaped ears
subclass of: Restriction
  on property: has belly wall
  some values from: bulging belly
subclass of: Restriction
  on property: has part
  some values from: belly
subclass of: Class
  complement of: Restriction
    on property: has part
    some values from: single handle
subclass of: Restriction
  on property: has ear location
  some values from: on the shoulder
subclass of: Restriction
  on property: has mouth shape
  some values from: circular mouth
subclass of: Class
  complement of: Restriction
    on property: has foot
    some values from: slender and spreading legs
subclass of: Class
  complement of: Restriction
    on property: has part
    some values from: constricted neck
subclass of: Restriction
  on property: has foot shape
  some values from: hoof-shaped legs
subclass of: Restriction
  on property: has part
  some values from: foot
subclass of: Restriction
  on property: has belly shape
  some values from: round body
subclass of: Class
  complement of: Restriction
    on property: has part
    some values from: Swing-handle
subclass of: Class
  complement of: Restriction
    on property: has part
    some values from: constricted waist
subclass of: Restriction
  on property: has top shape
  some values from: flat lid
subclass of: Restriction
  on property: has part
  some values from: ears
subclass of: Restriction
  on property: has part
  some values from: lid
subclass of: Restriction
  on property: has mouth
  some values from: StraightLipServingAsTenon
subclass of: Restriction
  on property: has part
  some values from: bottom
concept name: <Ding with lid flat lid straight lip serving as tenon small mouth circular mouth without door without swing-handle without spout without single handle with ears animal-shaped ears on the shoulder straight not constricted neck slanting shoulder not constricted waist round body bulging belly not tri-lobed bulging bottom three legs hoof-shaped legs not slender and spreading legs>
definition: Ding with flat lid,straight lip serving as tenon,small mouth,circular mouth,straight animal-shaped ears on the shoulder,slanting shoulder,round body,bulging belly,bulging bottom and three hoof-shaped legs
alternative label: Tangding 5
preferred label: 小口溜肩鼎5 @zh
alternative label: 汤鼎5 @zh
definition: 鼎带盖，平顶，子母口，小口 圆形口，竖直兽形耳在肩部，溜肩，圆体，鼓腹，圜底，三蹄足 @zh

Small-mouthed Ding 6
type: Class
subclass of: ding
subclass of: Class
  complement of: Restriction
    on property: has foot
    some values from: slender and spreading legs
subclass of: Restriction
  on property: has foot number
  some values from: ThreeFoot
subclass of: Restriction
  on property: has part
  some values from: slanting shoulder
subclass of: Class
  complement of: Restriction
    on property: has part
    some values from: Swing-handle
subclass of: Class
  complement of: Restriction
    on property: has part
    some values from: constricted waist
subclass of: Class
  complement of: Restriction
    on property: has part
    some values from: constricted neck
subclass of: Restriction
  on property: has ear location
  some values from: on the shoulder
subclass of: Restriction
  on property: has mouth
  some values from: small mouth
subclass of: Restriction
  on property: has ear direction
  some values from: Spreading
subclass of: Restriction
  on property: has part
  some values from: bulging belly
subclass of: Class
  complement of: Restriction
    on property: has bottom
    some values from: Tri-lobedBottom
subclass of: Restriction
  on property: has part
  some values from: bottom
subclass of: Restriction
  on property: has part
  some values from: lid
subclass of: Restriction
  on property: has top shape
  some values from: flat lid
subclass of: Restriction
  on property: has mouth shape
  some values from: circular mouth
subclass of: Class
  complement of: Restriction
    on property: has part
    some values from: door
subclass of: Restriction
  on property: has mouth
  some values from: StraightLipServingAsTenon
subclass of: Restriction
  on property: has part
  some values from: ears
subclass of: Restriction
  on property: has part
  some values from: foot
subclass of: Restriction
  on property: has bottom shape
  some values from: bulging bottom
subclass of: Class
  complement of: Restriction
    on property: has part
    some values from: spout
subclass of: Restriction
  on property: has ear shape
  some values from: VerticalEars
subclass of: Class
  complement of: Restriction
    on property: has part
    some values from: single handle
subclass of: Restriction
  on property: has foot shape
  some values from: hoof-shaped legs
concept name: <Ding with lid flat lid straight lip serving as tenon small mouth circular mouth without door without swing-handle without spout without single handle with ears vertical ears on the shoulder spreading not constricted neck slanting shoulder not constricted waist round body bulging belly not tri-lobed bulging bottom three legs hoof-shaped legs not slender and spreading legs>
definition: Ding with flat lid,straight lip serving as tenon,small mouth,circular mouth,spreading vertical ears on the shoulder,slanting shoulder,round body,bulging belly,bulging bottom and three hoof-shaped legs
alternative label: Tangding 6
preferred label: 小口溜肩鼎6 @zh
alternative label: 汤鼎6 @zh
definition: 鼎带盖，平顶，子母口，小口 圆形口，外撇立耳在肩部，溜肩，圆体，鼓腹，圜底，三蹄足 @zh

Small-mouthed Ding 7
type: Class
subclass of: ding
subclass of: Restriction
  on property: has part
  some values from: slanting shoulder
subclass of: Class
  complement of: Restriction
    on property: has foot
    some values from: slender and spreading legs
subclass of: Restriction
  on property: has ear location
  some values from: on the shoulder
subclass of: Restriction
  on property: has part
  some values from: lid
subclass of: Class
  complement of: Restriction
    on property: has part
    some values from: constricted neck
subclass of: Restriction
  on property: has belly shape
  some values from: round body
subclass of: Restriction
  on property: has mouth
  some values from: small mouth
subclass of: Restriction
  on property: has mouth
  some values from: StraightLipServingAsTenon
subclass of: Restriction
  on property: has part
  some values from: bulging bottom
subclass of: Restriction
  on property: has part
  some values from: ears
subclass of: Restriction
  on property: has belly wall
  some values from: bulging belly
subclass of: Restriction
  on property: has part
  some values from: belly
subclass of: Restriction
  on property: has part
  some values from: foot
subclass of: Class
  complement of: Restriction
    on property: has part
    some values from: constricted waist
subclass of: Restriction
  on property: has foot shape
  some values from: hoof-shaped legs
subclass of: Restriction
  on property: has foot number
  some values from: ThreeFoot
subclass of: Restriction
  on property: has ear direction
  some values from: Straight
subclass of: Class
  complement of: Restriction
    on property: has part
    some values from: door
subclass of: Class
  complement of: Restriction
    on property: has part
    some values from: single handle
subclass of: Restriction
  on property: has ear shape
  some values from: side ears
subclass of: Restriction
  on property: has top shape
  some values from: flat lid
subclass of: Class
  complement of: Restriction
    on property: has bottom
    some values from: Tri-lobedBottom
subclass of: Class
  complement of: Restriction
    on property: has part
    some values from: spout
subclass of: Restriction
  on property: has mouth shape
  some values from: circular mouth
subclass of: Class
  complement of: Restriction
    on property: has part
    some values from: Swing-handle
concept name: <Ding with lid flat lid straight lip serving as tenon small mouth circular mouth without door without swing-handle without spout without single handle with ears side ears on the shoulder straight not constricted neck slanting shoulder not constricted waist round body bulging belly not tri-lobed bulging bottom three legs hoof-shaped legs not slender and spreading legs>
definition: Ding with flat lid,straight lip serving as tenon,small mouth,circular mouth,straight side ears on the shoulder,slanting shoulder,round body,bulging belly,bulging bottom and three hoof-shaped legs
alternative label: Tangding 7
preferred label: 小口溜肩鼎7 @zh
alternative label: 汤鼎7 @zh
definition: 鼎带盖，平顶，子母口，小口 圆形口，竖直附耳在肩部，溜肩，圆体，鼓腹，圜底，三蹄足 @zh

small mouth
type: Class
subclass of: mouth
disjoint with: StraightLipServingAsTenon
preferred label: 小口 @zh

spout
type: Class
subclass of: part
preferred label: 流口 @zh

Spouted Ding 1
type: Class
subclass of: ding
subclass of: Class
  complement of: Restriction
    on property: has mouth
    some values from: StraightLipServingAsTenon
subclass of: Class
  complement of: Restriction
    on property: has part
    some values from: Swing-handle
subclass of: Restriction
  on property: has part
  some values from: mouth
subclass of: Restriction
  on property: has foot number
  some values from: ThreeFoot
subclass of: Restriction
  on property: has mouth shape
  some values from: circular mouth
subclass of: Class
  complement of: Restriction
    on property: has part
    some values from: door
subclass of: Restriction
  on property: has ear shape
  some values from: VerticalEars
subclass of: Class
  complement of: Restriction
    on property: has part
    some values from: slanting shoulder
subclass of: Restriction
  on property: has foot shape
  some values from: cylindrical legs
subclass of: Restriction
  on property: has belly shape
  some values from: round body
subclass of: Class
  complement of: Restriction
    on property: has mouth
    some values from: small mouth
subclass of: Restriction
  on property: has part
  some values from: ears
subclass of: Restriction
  on property: has ear location
  some values from: on the rim
subclass of: Class
  complement of: Restriction
    on property: has part
    some values from: single handle
subclass of: Restriction
  on property: has belly wall
  some values from: sagging belly
subclass of: Restriction
  on property: has part
  some values from: spout
subclass of: Class
  complement of: Restriction
    on property: has part
    some values from: lid
subclass of: Class
  complement of: Restriction
    on property: has part
    some values from: constricted neck
subclass of: Restriction
  on property: has ear direction
  some values from: Straight
subclass of: Class
  complement of: Restriction
    on property: has part
    some values from: constricted waist
subclass of: Class
  complement of: Restriction
    on property: has bottom
    some values from: Tri-lobedBottom
subclass of: Class
  complement of: Restriction
    on property: has foot
    some values from: slender and spreading legs
concept name: <Ding without lid not straight lip serving as tenon not small mouth circular mouth without door without swing-handle with spout without single handle with ears vertical ears on the rim straight not constricted neck not slanting shoulder not constricted waist round body sagging belly not tri-lobed bulging bottom three legs cylindrical legs not slender and spreading legs>
definition: Ding with circular mouth,spout,straight vertical ears on the rim,round body,sagging belly,bulging bottom and three cylindrical legs
preferred label: 流鼎1 @zh
definition: 鼎带圆形口，带流口，竖直立耳在口沿上，圆体，垂腹，圜底，三柱足 @zh

Spouted Ding 10
type: Class
subclass of: ding
subclass of: Restriction
  on property: has part
  some values from: lid
subclass of: Restriction
  on property: has part
  some values from: bottom
subclass of: Restriction
  on property: has top shape
  some values from: flat lid
subclass of: Restriction
  on property: has belly shape
  some values from: round body
subclass of: Class
  complement of: Restriction
    on property: has part
    some values from: constricted waist
subclass of: Restriction
  on property: has part
  some values from: ears
subclass of: Restriction
  on property: has part
  some values from: belly
subclass of: Restriction
  on property: has ear location
  some values from: UnderTheRim
subclass of: Restriction
  on property: has foot shape
  some values from: hoof-shaped legs
subclass of: Class
  complement of: Restriction
    on property: has part
    some values from: constricted neck
subclass of: Restriction
  on property: has part
  some values from: spout
subclass of: Restriction
  on property: has foot number
  some values from: ThreeFoot
subclass of: Restriction
  on property: has ear direction
  some values from: Straight
subclass of: Class
  complement of: Restriction
    on property: has part
    some values from: single handle
subclass of: Class
  complement of: Restriction
    on property: has foot
    some values from: slender and spreading legs
subclass of: Class
  complement of: Restriction
    on property: has mouth
    some values from: StraightLipServingAsTenon
subclass of: Class
  complement of: Restriction
    on property: has part
    some values from: slanting shoulder
subclass of: Restriction
  on property: has ear shape
  some values from: side ears
subclass of: Class
  complement of: Restriction
    on property: has mouth
    some values from: small mouth
subclass of: Restriction
  on property: has bottom shape
  some values from: bulging bottom
subclass of: Restriction
  on property: has belly wall
  some values from: bulging belly tapering downwards
subclass of: Class
  complement of: Restriction
    on property: has part
    some values from: door
subclass of: Restriction
  on property: has part
  some values from: foot
subclass of: Class
  complement of: Restriction
    on property: has part
    some values from: Swing-handle
subclass of: Restriction
  on property: has part
  some values from: mouth
subclass of: Restriction
  on property: has mouth shape
  some values from: circular mouth
subclass of: Class
  complement of: Restriction
    on property: has bottom
    some values from: Tri-lobedBottom
concept name: <Ding with lid flat lid not straight lip serving as tenon not small mouth circular mouth without door without swing-handle with spout without single handle with ears side ears under the rim straight not constricted neck not slanting shoulder not constricted waist round body bulging belly tapering downwards not tri-lobed bulging bottom three legs hoof-shaped legs not slender and spreading legs>
definition: Ding with flat lid,circular mouth,spout,straight side ears under the rim,round body,bulging belly tapering downwards,bulging bottom and three hoof-shaped legs
preferred label: Yiding 10
preferred label: 匜鼎10 @zh
preferred label: 流鼎10 @zh
definition: 鼎带盖，平顶，圆形口，带流口，竖直附耳在口沿下，圆体，敛腹，圜底，三蹄足 @zh

Spouted Ding 2
type: Class
subclass of: ding
subclass of: Class
  complement of: Restriction
    on property: has bottom
    some values from: Tri-lobedBottom
subclass of: Class
  complement of: Restriction
    on property: has part
    some values from: Swing-handle
subclass of: Class
  complement of: Restriction
    on property: has mouth
    some values from: StraightLipServingAsTenon
subclass of: Class
  complement of: Restriction
    on property: has part
    some values from: door
subclass of: Class
  complement of: Restriction
    on property: has part
    some values from: constricted waist
subclass of: Class
  complement of: Restriction
    on property: has mouth
    some values from: small mouth
subclass of: Class
  complement of: Restriction
    on property: has part
    some values from: lid
subclass of: Restriction
  on property: has mouth shape
  some values from: circular mouth
subclass of: Restriction
  on property: has part
  some values from: mouth
subclass of: Restriction
  on property: has part
  some values from: constricted neck
subclass of: Restriction
  on property: has foot number
  some values from: ThreeFoot
subclass of: Restriction
  on property: has part
  some values from: spout
subclass of: Class
  complement of: Restriction
    on property: has part
    some values from: slanting shoulder
subclass of: Restriction
  on property: has belly shape
  some values from: round body
subclass of: Class
  complement of: Restriction
    on property: has foot
    some values from: slender and spreading legs
subclass of: Restriction
  on property: has part
  some values from: bulging bottom
subclass of: Restriction
  on property: has belly wall
  some values from: bulging belly
subclass of: Restriction
  on property: has foot shape
  some values from: cylindrical legs
subclass of: Restriction
  on property: has part
  some values from: single handle
concept name: <Ding without lid not straight lip serving as tenon not small mouth circular mouth without door without swing-handle with spout with single handle without ears constricted neck not slanting shoulder not constricted waist round body bulging belly not tri-lobed bulging bottom three legs cylindrical legs not slender and spreading legs>
definition: Ding with circular mouth,spout,single handle,constricted neck,round body,bulging belly,bulging bottom and three cylindrical legs
alternative label: Yiding 2
alternative label: 匜鼎2 @zh
preferred label: 流鼎2 @zh
definition: 鼎带圆形口，带流口，带鋬, 束颈，圆体，鼓腹，圜底，三柱足 @zh

Spouted Ding 3
type: Class
subclass of: ding
subclass of: Restriction
  on property: has part
  some values from: ears
subclass of: Class
  complement of: Restriction
    on property: has part
    some values from: slanting shoulder
subclass of: Restriction
  on property: has ear shape
  some values from: side ears
subclass of: Restriction
  on property: has top shape
  some values from: flat lid
subclass of: Restriction
  on property: has belly wall
  some values from: bulging belly
subclass of: Class
  complement of: Restriction
    on property: has part
    some values from: constricted neck
subclass of: Class
  complement of: Restriction
    on property: has part
    some values from: single handle
subclass of: Restriction
  on property: has part
  some values from: foot
subclass of: Restriction
  on property: has ear direction
  some values from: Straight
subclass of: Restriction
  on property: has ear location
  some values from: UnderTheRim
subclass of: Restriction
  on property: has belly shape
  some values from: round body
subclass of: Restriction
  on property: has foot number
  some values from: ThreeFoot
subclass of: Restriction
  on property: has part
  some values from: lid
subclass of: Class
  complement of: Restriction
    on property: has bottom
    some values from: Tri-lobedBottom
subclass of: Restriction
  on property: has part
  some values from: bottom
subclass of: Restriction
  on property: has bottom shape
  some values from: flat bottom
subclass of: Class
  complement of: Restriction
    on property: has part
    some values from: door
subclass of: Restriction
  on property: has foot shape
  some values from: hoof-shaped legs
subclass of: Restriction
  on property: has part
  some values from: spout
subclass of: Class
  complement of: Restriction
    on property: has part
    some values from: constricted waist
subclass of: Class
  complement of: Restriction
    on property: has foot
    some values from: slender and spreading legs
subclass of: Class
  complement of: Restriction
    on property: has mouth
    some values from: small mouth
subclass of: Restriction
  on property: has mouth
  some values from: StraightLipServingAsTenon
subclass of: Restriction
  on property: has mouth shape
  some values from: circular mouth
subclass of: Class
  complement of: Restriction
    on property: has part
    some values from: Swing-handle
concept name: <Ding with lid flat lid straight lip serving as tenon not small mouth circular mouth without door without swing-handle with spout without single handle with ears side ears under the rim straight not constricted neck not slanting shoulder not constricted waist round body bulging belly not tri-lobed flat bottom three legs hoof-shaped legs not slender and spreading legs>
definition: Ding with flat lid,straight lip serving as tenon,circular mouth,spout,straight side ears under the rim,round body,bulging belly,flat bottom and three hoof-shaped legs
alternative label: Yiding 3
alternative label: 匜鼎3 @zh
preferred label: 流鼎3 @zh
definition: 鼎带盖，平顶，子母口，圆形口，带流口，竖直附耳在口沿下，圆体，鼓腹，平底，三蹄足 @zh

Spouted Ding 4
type: Class
subclass of: ding
subclass of: Restriction
  on property: has foot number
  some values from: ThreeFoot
subclass of: Restriction
  on property: has ear direction
  some values from: Straight
subclass of: Restriction
  on property: has part
  some values from: ears
subclass of: Class
  complement of: Restriction
    on property: has part
    some values from: lid
subclass of: Restriction
  on property: has part
  some values from: foot
subclass of: Class
  complement of: Restriction
    on property: has part
    some values from: door
subclass of: Restriction
  on property: has part
  some values from: mouth
subclass of: Class
  complement of: Restriction
    on property: has mouth
    some values from: StraightLipServingAsTenon
subclass of: Class
  complement of: Restriction
    on property: has mouth
    some values from: small mouth
subclass of: Class
  complement of: Restriction
    on property: has part
    some values from: constricted neck
subclass of: Restriction
  on property: has part
  some values from: bottom
subclass of: Restriction
  on property: has belly wall
  some values from: StraightBelly
subclass of: Restriction
  on property: has ear shape
  some values from: side ears
subclass of: Restriction
  on property: has foot shape
  some values from: hoof-shaped legs
subclass of: Class
  complement of: Restriction
    on property: has part
    some values from: slanting shoulder
subclass of: Restriction
  on property: has bottom shape
  some values from: flat bottom
subclass of: Class
  complement of: Restriction
    on property: has part
    some values from: Swing-handle
subclass of: Class
  complement of: Restriction
    on property: has part
    some values from: constricted waist
subclass of: Restriction
  on property: has part
  some values from: spout
subclass of: Restriction
  on property: has belly shape
  some values from: round body
subclass of: Class
  complement of: Restriction
    on property: has foot
    some values from: slender and spreading legs
subclass of: Class
  complement of: Restriction
    on property: has part
    some values from: single handle
subclass of: Class
  complement of: Restriction
    on property: has bottom
    some values from: Tri-lobedBottom
subclass of: Restriction
  on property: has mouth shape
  some values from: circular mouth
concept name: <Ding without lid not straight lip serving as tenon not small mouth circular mouth without door without swing-handle with spout without single handle with ears side ears under the rim straight not constricted neck not slanting shoulder not constricted waist round body straight belly not tri-lobed flat bottom three legs hoof-shaped legs not slender and spreading legs>
definition: Ding with circular mouth,spout,straight side ears under the rim,round body,straight belly,flat bottom and three hoof-shaped legs
alternative label: Yiding 4
alternative label: 匜鼎4 @zh
preferred label: 流鼎4 @zh
definition: 鼎带圆形口，带流口，竖直附耳在口沿下，圆体，直腹，平底，三蹄足 @zh